program: Gaussian 09
title: 000233312
version: EM64L-G09RevD.01
frameworkgroup: C1[X(C15H19N3O6)]
method: RPBEPBE
basis: SDD
operation: Freq
keyword: #p
keyword: freq=noraman
keyword: PBEPBE/SDD
title: #p freq=noraman PBEPBE/SDD
converged: YES YES NO NO
title: Mulliken charges:
elementType: O O O O O O N N N C C C C C C C C C C C C C C C H H H H H H H H H H H H H H H H H H H
charge: -0.403442 -0.299529 -0.301655 -0.204729 -0.202511 -0.252005 -0.443563 -0.425697 0.063272 -0.016067 0.291910 0.261569 0.381169 -0.258475 -0.253760 -0.657459 -0.648213 0.444185 -0.385169 -0.381427 -0.364870 -0.224661 -0.219344 -0.234563 0.338811 0.388056 0.243168 0.227349 0.224761 0.241402 0.224467 0.259799 0.222342 0.273959 0.226205 0.206790 0.267921 0.202247 0.220817 0.279719 0.227635 0.229416 0.230169
chargesum: 0.00000
title: Mulliken charges with hydrogens summed into heavy atoms:
elementType: O O O O O O N N N C C C C C C C C C C C C C C C
charge: -0.015387 -0.299529 -0.301655 -0.204729 -0.202511 -0.252005 -0.104752 -0.157775 0.063272 -0.016067 0.291910 0.261569 0.381169 0.212043 0.212403 0.049149 0.058741 0.444185 -0.182923 -0.160609 -0.085151 0.002974 0.010073 -0.004395
polarizability: 3.51411047e+02 2.87796935e+00 2.28372349e+02 6.90543298e+00 2.79756759e+00 1.20795577e+02
1716.lowfreq: -5.5956 -2.4633 -0.0007 -0.0006 -0.0004 1.9468 20.6241 24.0046 28.2238
frequency: 20.3366 23.9517 28.1982 28.9966 39.0445 48.3746 58.2126 69.1126 85.0892 87.5979 110.1628 116.8917 140.7504 153.3151 172.9681 183.6589 202.0628 207.0457 217.1167 241.8408 245.1058 259.7686 296.4472 304.8733 315.7303 333.5507 360.8628 379.8472 404.1328 405.8833 426.0556 443.3104 457.4616 494.0793 513.7786 534.4537 594.2685 614.8550 619.1339 627.9884 662.1815 699.1679 704.6498 712.7687 720.1710 748.4375 758.0201 771.4374 807.8719 818.6758 821.2639 841.3824 855.1497 859.5209 916.9947 945.3573 947.7359 984.3094 984.9446 987.3887 1002.3297 1005.3787 1007.7839 1020.5304 1023.7026 1066.8476 1087.2613 1096.2405 1099.7283 1134.6500 1145.9825 1155.5806 1161.8363 1173.1270 1184.7927 1198.0810 1219.4228 1240.4238 1272.1030 1274.7348 1315.3678 1326.5483 1347.5743 1352.6201 1354.9006 1389.8654 1394.7607 1401.2935 1438.3760 1457.7123 1459.5587 1461.8018 1463.3578 1464.3078 1481.1936 1482.1145 1483.4845 1520.2999 1573.0583 1598.1388 1613.6136 1647.2972 1653.4936 1673.7483 2960.2022 2996.4580 2997.7965 3034.0130 3036.4591 3091.0946 3093.2475 3099.5878 3102.4174 3114.9754 3125.2160 3126.9700 3130.1370 3143.0318 3157.9868 3169.0790 3367.9620 3458.4146 3531.0260
redmass: 3.9187 4.5093 4.5807 4.1600 2.6650 4.5978 3.9206 5.2717 6.1633 3.9360 5.7984 6.0498 5.4782 4.6344 3.0424 1.8829 2.0368 2.6248 2.9546 2.1119 6.1440 4.9106 3.4097 3.8091 3.7720 3.8722 2.2118 5.7491 2.5709 2.4692 2.5560 3.2437 6.6666 1.9188 3.5037 3.0182 6.0121 6.4767 1.7949 2.7673 5.3798 1.8069 5.8287 8.2734 7.0929 3.8139 3.2395 1.7475 1.7471 1.5222 2.4169 3.8400 1.2537 4.3895 1.3767 3.7315 1.5779 1.3737 9.3675 6.2507 2.8736 1.3352 3.4231 4.7178 2.2024 4.2394 1.8512 2.1859 2.1557 4.2431 3.0689 1.7152 1.8878 1.0581 1.1133 5.1564 2.1099 1.9108 1.1305 1.1197 1.5406 1.6145 1.5176 1.2700 1.2932 5.9636 1.2290 1.2197 2.3037 1.1033 1.0992 1.2809 1.0750 1.2320 1.0636 2.2222 1.0521 1.9523 6.3914 5.8157 6.0634 7.0848 9.6801 10.8268 1.0866 1.0363 1.0370 1.0594 1.0596 1.0976 1.0980 1.1031 1.1042 1.0875 1.1066 1.1047 1.0867 1.0921 1.0961 1.1004 1.0750 1.0648 1.0777
irintensity: 0.0038 0.0107 1.2603 2.1774 0.3394 2.6562 4.1185 1.6551 5.6150 4.8588 4.7449 2.7819 1.9720 1.9689 2.4515 3.0837 3.2436 15.2291 0.8126 1.4698 4.5636 10.9619 10.2894 1.7159 27.1380 0.3427 58.6477 25.4152 7.2075 17.0875 12.7872 0.8997 7.5406 5.4555 7.9016 1.9035 69.2163 0.0830 153.2714 48.7242 14.8533 45.0998 8.2747 34.2949 2.6750 3.1603 40.5862 44.6786 5.4108 3.0569 12.8636 5.1021 0.6101 3.1289 5.7021 66.7539 33.5345 0.2316 132.9240 1.6792 42.7300 1.6296 29.7690 240.7600 28.5747 246.5914 64.5413 34.7260 47.1541 133.8354 421.6809 6.9606 29.6912 0.0961 1.1222 130.4999 313.7840 81.3010 6.7497 4.5394 24.5250 172.6530 13.1123 6.4063 19.7553 1.0394 26.4218 18.4367 16.3726 69.7743 74.1677 269.7828 7.3519 213.3424 55.7221 95.5179 18.1816 438.8442 1.1223 0.3920 0.9679 397.1663 81.3502 131.7289 61.7057 16.1422 17.6101 36.0088 28.3520 34.5556 31.9637 1.8318 3.0291 10.3843 24.6737 22.9811 0.1895 26.1649 24.8468 22.5456 16.7821 103.7804 86.3168
temp: 298.150 k
press: 1.00000 atm
elementType: 8 8 8 8 8 8 7 7 7 6 6 6 6 6 6 6 6 6 6 6 6 6 6 6 1 1 1 1 1 1 1 1 1 1 1 1 1 1 1 1 1 1 1
symmnumber: 1
zpe: 867740.3 jmol-1
zpe.correction: 0.330505 hartree
zpe.thermalcorrener: 0.355830 hartree
zpe.thermalcorrenthalpy: 0.356775 hartree
zpe.thermalcorrgfe: 0.271525 hartree
zpe.sumelectzpe: -1196.772931 hartree
zpe.sumelectthermal: -1196.747606 hartree
zpe.sumelectthermalent: -1196.746662 hartree
zpe.sumelectthermalfe: -1196.831911 hartree
dipole: -0.8344 -4.2375 0.0127
dipole: 4.3189
quadrupole: -126.5237 -103.4468 -151.4651
quadrupole: -2.1772 0.8660 1.2472
quadrupole: 0.6215 23.6984 -24.3199 -2.1772 0.8660 1.2472
hfenergy: -1197.1034363 hartree
pointgroup: C01 [X(C15H19N3O6)]
dipole: -0.530048 -1.6131146 0.0644473 debye
polarizability: 350.4724372|-12.0827077|229.5599512|2.1034166|-0.9490616|120.5465843 unknown
InChI: InChI=1S/C15H19N3O6/c1-3-23-12(19)15(22,13(20)24-4-2)17-14(21)18-16-10-11-8-6-5-7-9-11/h5-10,17-18,22H,3-4H2,1-2H3
charge 0 multiplicity 1
43 atoms
O  2.887389 0.110551 1.889095
O  3.260673 -2.627869 0.368514
O  3.290886 2.033792 0.213326
O  4.927457 -1.064641 -0.117364
O  2.707614 0.84678 -1.71884
O  0.29449 1.219466 0.249652
N  1.342996 -0.861402 0.318771
N  -0.990499 -0.767495 0.268456
N  -2.19244 -0.097545 0.195691
C  2.658159 -0.278772 0.498379
C  3.751836 -1.338769 0.186221
C  2.852561 0.922815 -0.486419
C  0.216528 -0.036881 0.280326
C  4.242741 -3.75004 0.185586
C  3.383984 3.3241 -0.547374
C  4.344266 -4.141316 -1.289744
C  2.041369 4.054236 -0.489605
C  -4.615733 -0.182542 0.112359
C  -3.294219 -0.818475 0.187761
C  -5.780537 -0.998458 0.109164
C  -4.761183 1.233219 0.0417
C  -7.064232 -0.416091 0.037179
C  -6.043401 1.809199 -0.030286
C  -7.2006 0.989357 -0.033041
H  1.294548 -1.880045 0.390535
H  3.085518 1.08852 1.886764
H  5.215421 -3.416967 0.586753
H  3.828156 -4.556949 0.810059
H  4.192421 3.870925 -0.036894
H  3.680764 3.080614 -1.582316
H  3.357811 -4.421344 -1.697468
H  4.756525 -3.312532 -1.888464
H  5.019794 -5.010517 -1.393636
H  1.244395 3.44518 -0.945097
H  1.751822 4.271088 0.552317
H  2.12192 5.010378 -1.039632
H  -0.962838 -1.798006 0.314024
H  -3.277584 -1.927763 0.236409
H  -5.67793 -2.090024 0.163135
H  -3.858724 1.852831 0.044925
H  -7.954434 -1.05478 0.035562
H  -6.147574 2.898624 -0.084476
H  -8.19622 1.443254 -0.089408
