program: Gaussian 09
title: 000233293
version: EM64L-G09RevD.01
frameworkgroup: C1[X(C16H17NO5)]
method: RPBEPBE
basis: SDD
operation: Freq
keyword: #p
keyword: freq=noraman
keyword: PBEPBE/SDD
title: #p freq=noraman PBEPBE/SDD
converged: YES YES NO NO
title: Mulliken charges:
elementType: O O O O O N C C C C C C C C C C C C C C C C H H H H H H H H H H H H H H H H H
charge: -0.271088 -0.307365 -0.298364 -0.441497 -0.223798 -0.696802 0.122636 0.396574 0.085301 0.176246 0.038387 0.277865 -0.538371 -0.371135 -0.332885 -0.418028 -0.436569 0.495025 0.050085 -0.522575 -0.526010 -0.526798 0.295168 0.231606 0.208434 0.212752 0.211541 0.206223 0.260893 0.233246 0.236371 0.227219 0.256857 0.223519 0.230155 0.250749 0.303124 0.303543 0.377764
chargesum: 0.00000
title: Mulliken charges with hydrogens summed into heavy atoms:
elementType: O O O O O N C C C C C C C C C C C C C C C C
charge: -0.271088 -0.307365 -0.298364 -0.063733 -0.223798 -0.090135 0.122636 0.396574 0.085301 0.176246 0.038387 0.277865 -0.243203 -0.139528 -0.124451 -0.205275 -0.225028 0.495025 0.050085 0.177787 0.194437 0.177625
polarizability: 3.28817164e+02 -1.03159213e+01 2.06956295e+02 4.31492789e-02 1.32052935e+01 1.28913013e+02
1716.lowfreq: -7.8508 -5.7149 0.0000 0.0006 0.0007 2.8948 29.5885 35.7880 52.4882
frequency: 29.5022 35.7516 52.4484 57.1692 65.9669 69.1764 91.7777 94.9270 115.0688 143.7565 151.2455 154.4869 162.1007 175.0529 182.5668 191.9660 239.3309 248.7259 275.9920 304.6289 312.6910 338.0999 349.2920 365.7864 371.6476 374.1195 391.3625 410.0641 414.9771 449.8515 515.4288 526.8383 530.6816 565.2292 591.6539 618.1170 631.2649 650.7364 666.2132 682.7027 726.9733 751.3553 767.5612 795.4040 810.0153 821.3506 827.4593 864.6189 882.0970 912.5227 936.9897 947.8232 953.2073 964.5788 999.4994 1016.7573 1030.2297 1060.9448 1100.7943 1108.6894 1111.4283 1113.3076 1130.8982 1150.0103 1153.9020 1157.9193 1182.8794 1190.8401 1244.6679 1272.1368 1304.5458 1311.2095 1317.4001 1346.9905 1365.0813 1379.7577 1415.1054 1430.3836 1435.2164 1440.0974 1446.8501 1455.3736 1458.9634 1461.3983 1476.3144 1483.8701 1486.2120 1521.9991 1538.4530 1573.8360 1587.0912 1631.8338 1642.7333 1645.0881 2967.9235 2972.7147 2981.5166 3070.3829 3075.1014 3083.2377 3113.0489 3115.7452 3122.0632 3124.2450 3124.6010 3137.4777 3146.9172 3191.2078 3520.5516 3567.7408 3708.4972
redmass: 4.5401 5.9808 5.1512 3.8762 4.1568 3.6444 2.8800 3.2493 1.8741 1.6259 4.6700 1.3036 1.2631 2.9915 3.3944 3.0927 6.2133 5.2318 4.4161 7.2999 7.1454 1.6045 2.4869 4.7048 1.0434 5.8367 4.9349 2.8780 5.2227 5.0612 4.9532 3.2708 4.7062 2.3823 3.5675 2.1068 5.9610 5.4873 5.7589 4.7182 4.0472 8.5768 5.5535 5.1975 1.2707 4.9288 2.0563 7.9783 7.6087 1.5452 1.4486 6.2815 1.3804 9.2144 3.2044 1.4500 4.1654 4.1068 2.7200 1.2970 1.2519 1.2458 1.2389 1.3596 1.3616 1.4350 1.9791 1.1028 2.1500 3.2837 1.5207 3.2159 3.5291 7.1986 3.8004 4.3427 1.4127 1.3700 1.5386 2.2905 2.3651 1.0801 1.0550 1.1049 1.0549 1.0539 1.0558 3.5171 8.1012 6.9136 7.5609 2.3777 1.8991 5.5293 1.0348 1.0311 1.0293 1.1036 1.0973 1.1057 1.0870 1.0873 1.1027 1.1040 1.1035 1.0964 1.0965 1.0920 1.0640 1.0448 1.1040
irintensity: 1.7023 0.8297 4.2249 0.7854 2.7130 1.2244 6.4486 2.8552 3.2876 4.6496 0.6090 0.6777 0.2751 0.6022 0.6557 4.4964 3.6438 14.8098 13.9182 1.0891 5.9882 181.2685 119.7524 4.6407 0.7288 1.5271 3.4610 3.5358 3.5250 4.9863 13.0923 7.7893 8.8777 61.7121 73.4961 51.1984 7.1138 3.5725 14.1471 7.0923 2.1209 13.4097 6.2627 17.6553 3.6266 8.7549 56.8555 35.2222 10.4189 27.3176 7.1946 110.5149 1.5958 221.1918 32.8185 0.9910 256.8696 32.2391 127.7797 3.5144 6.4858 6.8030 19.1521 11.4340 3.6022 13.1942 34.8482 43.7286 72.3685 36.6642 36.0159 179.4301 57.0542 44.3210 59.0361 35.0467 69.3766 33.3786 10.7884 15.1426 223.3966 1.6285 15.5422 6.7931 5.0698 21.0365 20.2989 30.5988 18.6209 3.2318 15.7634 22.3908 187.0001 493.5912 67.7678 91.0985 63.4627 25.6697 34.2572 19.1480 7.6469 37.2354 26.9843 13.2576 22.9369 34.6864 9.8220 2.5496 35.3853 103.2091 19.4443
temp: 298.150 k
press: 1.00000 atm
elementType: 8 8 8 8 8 7 6 6 6 6 6 6 6 6 6 6 6 6 6 6 6 6 1 1 1 1 1 1 1 1 1 1 1 1 1 1 1 1 1
symmnumber: 1
zpe: 788124.0 jmol-1
zpe.correction: 0.300181 hartree
zpe.thermalcorrener: 0.322805 hartree
zpe.thermalcorrenthalpy: 0.323750 hartree
zpe.thermalcorrgfe: 0.247763 hartree
zpe.sumelectzpe: -1049.118139 hartree
zpe.sumelectthermal: -1049.095514 hartree
zpe.sumelectthermalent: -1049.094570 hartree
zpe.sumelectthermalfe: -1049.170556 hartree
dipole: -0.0719 -2.1664 -0.3653
dipole: 2.1982
quadrupole: -91.9708 -118.2339 -124.1412
quadrupole: -0.0792 6.2765 5.5248
quadrupole: 19.4778 -6.7852 -12.6926 -0.0792 6.2765 5.5248
hfenergy: -1049.4183195 hartree
pointgroup: C01 [X(C16H17N1O5)]
dipole: -0.0289195 0.8223209 0.2662058 debye
polarizability: 328.8089197|10.1685094|201.5000549|1.8721735|23.9071436|134.3774964 unknown
InChI: InChI=1S/C16H17NO5/c1-20-12-8-11(16(18)19)13(15(22-3)14(12)21-2)9-4-6-10(17)7-5-9/h4-8,18H,17H2,1-3H3
charge 0 multiplicity 1
39 atoms
O  -0.349492 2.19202 0.279629
O  -3.134046 1.769038 0.121728
O  -4.132352 -0.913246 -0.283088
O  -0.162673 -3.810851 -0.744534
O  1.509835 -2.86048 0.544575
N  5.723768 0.921193 -0.044393
C  0.07726 -0.193012 0.099236
C  1.538692 0.099125 0.079794
C  -0.858238 0.883445 0.206434
C  -0.452543 -1.508924 -0.110621
C  -2.257391 0.662249 0.075408
C  -2.751408 -0.656987 -0.120212
C  -1.850156 -1.725339 -0.228824
C  2.340606 -0.327255 -1.011648
C  2.176384 0.822239 1.120546
C  3.717948 -0.056554 -1.064151
C  3.5555 1.089654 1.092022
C  4.353938 0.653588 -0.005151
C  0.420214 -2.718209 -0.056557
C  -0.787696 3.019897 1.42269
C  -3.791144 2.067376 -1.177265
C  -4.96648 -0.603066 0.901821
H  -2.237566 -2.734531 -0.381353
H  1.871819 -0.867823 -1.842666
H  1.587627 1.160585 1.980409
H  4.308627 -0.392673 -1.925332
H  4.023709 1.635553 1.920524
H  -0.496112 2.541317 2.378458
H  -1.878014 3.181215 1.396359
H  -0.249068 3.972399 1.304302
H  -3.027827 2.347533 -1.925563
H  -4.458306 2.919885 -0.978861
H  -4.369811 1.193532 -1.52566
H  -4.682151 -1.258271 1.747003
H  -6.00122 -0.817164 0.594005
H  -4.860195 0.457257 1.19303
H  6.179506 1.415462 0.716485
H  6.295917 0.592075 -0.815961
H  0.432034 -4.598553 -0.616721
