program: Gaussian 09
title: 000233256
version: EM64L-G09RevD.01
frameworkgroup: C1[X(C12H17NO)]
method: RPBEPBE
basis: SDD
operation: Freq
keyword: #p
keyword: freq=noraman
keyword: PBEPBE/SDD
title: #p freq=noraman PBEPBE/SDD
converged: YES YES NO NO
title: Mulliken charges:
elementType: O N C C C C C C C C C C C C H H H H H H H H H H H H H H H H H
charge: -0.261117 -0.610725 -0.318033 -0.438708 -0.343813 0.424643 -0.350776 0.164106 -0.383210 -0.431362 -0.698698 -0.235953 -0.223260 -0.245397 0.239966 0.199768 0.253855 0.208304 0.181037 0.194544 0.198931 0.244560 0.237112 0.210180 0.215577 0.209825 0.228380 0.228603 0.327467 0.343516 0.230676
chargesum: 0.00000
title: Mulliken charges with hydrogens summed into heavy atoms:
elementType: O N C C C C C C C C C C C C
charge: -0.261117 0.060257 -0.078067 0.014916 0.045528 0.424643 0.042699 0.164106 -0.138649 -0.194250 -0.063116 -0.007573 0.005343 -0.014721
polarizability: 1.40751526e+02 2.30174961e+01 1.44602702e+02 -2.85489239e+00 3.10826551e+00 1.18727650e+02
1716.lowfreq: 0.0003 0.0005 0.0005 5.4333 9.2175 12.8580 26.3759 40.3325 44.7354
frequency: 23.5141 40.1317 44.6915 52.0856 94.2840 104.4736 129.1777 204.0670 214.0374 229.9639 260.2791 295.7504 360.6626 402.8038 403.8558 443.8891 492.0520 554.3674 560.3423 591.0005 614.4752 620.7473 689.5489 706.3637 727.0932 753.4787 775.6066 820.6456 856.1844 864.5916 907.2282 927.6143 937.1406 978.4633 989.3282 997.0737 1005.8692 1027.5968 1049.6151 1059.2453 1073.5691 1081.2830 1111.9287 1119.0461 1172.8474 1189.4581 1201.0626 1205.5252 1232.7319 1265.7764 1277.1605 1290.5908 1301.0782 1323.7380 1331.8856 1340.0870 1356.3657 1380.5140 1387.4975 1440.2155 1464.5091 1468.6950 1476.6475 1479.1985 1482.3715 1487.0606 1576.6636 1588.9729 1610.0202 1634.1755 2953.7099 2961.9596 2967.5161 2971.5557 2986.9733 2998.4727 3024.7631 3058.0213 3068.8053 3070.8945 3117.7600 3121.2752 3135.1159 3145.8750 3163.7629 3509.8374 3665.2849
redmass: 4.2173 3.8039 3.5198 1.7254 3.5703 4.0057 2.7704 2.4969 2.6471 1.4080 3.0061 4.4677 5.4384 2.9430 2.8160 2.9974 2.7991 1.1776 2.6910 3.7233 2.9630 2.2904 2.8122 1.7823 1.1244 1.6604 1.8906 1.8146 1.2481 2.7243 1.7310 1.4414 1.5756 1.3906 5.8314 1.3292 3.6080 2.2925 2.1032 1.7641 1.8012 2.1095 2.3093 1.8269 1.0577 1.1156 1.7546 1.6928 1.2522 1.3532 1.3588 1.0690 1.4360 3.3055 1.4242 1.3669 1.6405 6.5207 1.2185 2.1561 1.0725 1.0736 1.0429 1.1079 2.1100 1.0912 1.5336 5.5091 5.9682 3.5476 1.0601 1.0798 1.0594 1.0367 1.0637 1.0968 1.1019 1.1007 1.1008 1.0993 1.0869 1.0866 1.0911 1.0960 1.1015 1.0443 1.1045
irintensity: 3.7152 1.3498 4.3950 0.0692 0.0475 1.5997 0.7157 0.0675 4.8790 1.2563 0.3042 0.7019 12.4625 2.1068 0.0784 1.6167 2.2760 168.1493 28.8362 5.3087 11.9628 30.0010 22.6617 50.9925 14.9662 18.4579 15.2158 0.8271 0.9221 3.2595 3.0995 4.1977 8.2370 0.3390 0.0416 0.1650 3.3878 4.5493 1.8847 1.4280 6.9310 2.0122 13.1974 2.4743 0.0802 0.1625 0.2417 1.3248 11.3737 0.1590 0.0530 0.5336 17.2340 129.3020 5.8760 1.5168 0.7408 0.1182 11.7942 8.8629 1.0726 0.9108 12.0519 4.3749 16.2985 20.4946 130.1969 2.4307 26.5691 269.6870 7.1152 8.0772 46.2693 33.8457 40.1622 1.3502 21.6873 15.9093 97.2012 54.1751 7.5398 2.4118 10.0858 36.9981 21.5693 24.5404 44.6028
temp: 298.150 k
press: 1.00000 atm
elementType: 8 7 6 6 6 6 6 6 6 6 6 6 6 6 1 1 1 1 1 1 1 1 1 1 1 1 1 1 1 1 1
symmnumber: 1
zpe: 694322.1 jmol-1
zpe.correction: 0.264453 hartree
zpe.thermalcorrener: 0.279103 hartree
zpe.thermalcorrenthalpy: 0.280047 hartree
zpe.thermalcorrgfe: 0.220690 hartree
zpe.sumelectzpe: -596.412828 hartree
zpe.sumelectthermal: -596.398178 hartree
zpe.sumelectthermalent: -596.397234 hartree
zpe.sumelectthermalfe: -596.456591 hartree
dipole: -2.7464 -2.8157 -0.1078
dipole: 3.9348
quadrupole: -77.2410 -96.1519 -79.9408
quadrupole: -3.2121 -1.0646 0.2246
quadrupole: 7.2036 -11.7073 4.5038 -3.2121 -1.0646 0.2246
hfenergy: -596.6772812 hartree
pointgroup: C01 [X(C12H17N1O1)]
dipole: 1.2824905 -0.8550071 0.1437359 debye
polarizability: 150.1615508|-21.8575638|134.4062123|0.3900685|-5.4528294|119.5141151 unknown
InChI: InChI=1S/C12H17NO/c1-2-3-9-11(12(13)14)10-7-5-4-6-8-10/h4-8,11H,2-3,9,13H2,1H3
charge 0 multiplicity 1
31 atoms
O  -1.086042 3.439201 -0.23781
N  1.162157 2.893155 -0.152685
C  -0.512767 1.128632 0.422654
C  -1.816812 0.645711 -0.277484
C  -2.427462 -0.607063 0.38349
C  0.641642 0.137874 0.28998
C  -3.716607 -1.085771 -0.323759
C  -0.178521 2.578472 -0.035596
C  1.134677 -0.243605 -0.988551
C  1.243326 -0.436064 1.439669
C  -4.338544 -2.331762 0.342289
C  2.192618 -1.170517 -1.11049
C  2.302693 -1.365814 1.32232
C  2.781713 -1.736693 0.045382
H  -0.750804 1.235112 1.502925
H  -1.607735 0.438919 -1.346142
H  -2.536764 1.484394 -0.253418
H  -1.687781 -1.433224 0.388906
H  -2.657436 -0.384769 1.447419
H  -3.486232 -1.309108 -1.385699
H  -4.456398 -0.259701 -0.333655
H  0.685581 0.186417 -1.891883
H  0.87355 -0.155942 2.433965
H  -3.626358 -3.178594 0.340439
H  -5.254015 -2.658096 -0.184696
H  -4.609875 -2.12469 1.394801
H  2.557896 -1.452671 -2.104563
H  2.74918 -1.800479 2.223763
H  1.416007 3.848325 -0.403697
H  1.887374 2.18898 -0.022635
H  3.60094 -2.458029 -0.049441
