program: Gaussian 09
title: 000233247
version: EM64L-G09RevD.01
frameworkgroup: C1[X(C7H3Cl2NO5)]
method: RPBEPBE
basis: SDD
operation: Freq
keyword: #p
keyword: freq=noraman
keyword: PBEPBE/SDD
title: #p freq=noraman PBEPBE/SDD
converged: YES YES NO YES
title: Mulliken charges:
elementType: Cl Cl O O O O O N C C C C C C C H H H
charge: 0.088630 0.088630 -0.197120 -0.474560 -0.474560 -0.173724 -0.173724 -0.444088 0.285109 0.285109 -0.372194 -0.372194 0.419805 0.134146 0.134146 0.430762 0.407913 0.407913
chargesum: 0.00000
title: Mulliken charges with hydrogens summed into heavy atoms:
elementType: Cl Cl O O O O O N C C C C C C C
charge: 0.088630 0.088630 -0.197120 -0.066647 -0.066647 -0.173724 -0.173724 -0.013326 0.285109 0.285109 -0.372194 -0.372194 0.419805 0.134146 0.134146
polarizability: 1.75651624e+02 -3.81086299e-05 1.64641642e+02 1.21461864e-02 -4.68011507e-04 4.53472641e+01
1716.lowfreq: -0.2171 -0.0026 -0.0024 0.0012 2.6734 5.3154 53.8916 55.5926 59.2154
frequency: 53.8908 55.5923 59.2146 71.5564 119.8329 144.6838 193.3321 200.0821 273.0548 292.7158 297.1023 304.4041 316.7674 363.4564 383.5748 437.7802 498.7765 498.8834 560.8952 587.2712 598.7519 603.0660 638.2813 655.6308 713.5361 729.7397 738.7854 768.7895 817.2228 891.2718 934.8526 1022.7321 1042.8928 1101.1003 1158.0422 1215.7615 1229.8916 1330.7513 1343.1895 1493.6199 1545.2632 1559.7572 1572.4411 1671.7596 1679.5827 3463.1839 3559.5005 3559.8308
redmass: 13.6376 18.4681 9.2874 18.4617 8.2689 8.7067 14.3303 25.3546 12.8436 9.7022 16.9550 8.3288 16.5539 10.1345 16.9199 9.7087 2.6889 3.8212 5.3167 1.4191 7.1719 1.5298 5.2888 6.7493 10.3608 9.8825 11.8393 10.3532 1.1517 12.3323 10.4147 2.8687 5.4600 3.6894 3.4788 2.8549 2.8009 5.1401 1.8170 4.0288 12.8840 4.8650 11.8979 9.9270 9.9190 1.0777 1.0651 1.0652
irintensity: 0.9554 0.0000 0.0000 2.2572 0.2736 0.0046 0.1081 0.0550 0.9797 0.1726 0.1094 0.0000 1.8354 0.1015 0.6229 6.9019 83.3076 0.0311 35.1740 0.0001 47.9998 264.4008 43.1086 14.8698 19.3037 50.6055 0.0000 0.0593 91.9893 35.2380 209.5853 38.3180 647.9856 67.9080 5.6397 0.6771 5.8387 109.3707 107.9319 49.5782 207.8194 5.2642 5.0613 456.9171 0.0000 260.1229 34.7960 135.0715
temp: 298.150 k
press: 1.00000 atm
elementType: 17 17 8 8 8 8 8 7 6 6 6 6 6 6 6 1 1 1
symmnumber: 1
zpe: 259303.1 jmol-1
zpe.correction: 0.098763 hartree
zpe.thermalcorrener: 0.112546 hartree
zpe.thermalcorrenthalpy: 0.113490 hartree
zpe.thermalcorrgfe: 0.056679 hartree
zpe.sumelectzpe: -1618.453755 hartree
zpe.sumelectthermal: -1618.439973 hartree
zpe.sumelectthermalent: -1618.439028 hartree
zpe.sumelectthermalfe: -1618.495839 hartree
dipole: 0.0000 8.2294 -0.0001
dipole: 8.2294
quadrupole: -107.2159 -91.5779 -96.5782
quadrupole: 0.0000 -0.0147 0.0012
quadrupole: -8.7586 6.8794 1.8792 0.0000 -0.0147 0.0012
hfenergy: -1618.5525182 hartree
pointgroup: C01 [X(C7H3Cl2N1O5)]
dipole: -0.0000539 3.2377104 0.0004236 debye
dipolederiv: -0.5163793 0.32814 -0.0321155 0.2928189 -0.173946 0.017172 -0.032156 0.0191659 0.0307313 -0.5163572 -0.3281424 -0.0322039 -0.2928221 -0.1739574 -0.0172177 -0.0322468 -0.0192321 0.0307204 -0.2742087 0.0000169 0.0023203 0.0000098 -1.0196838 -0.0000676 0.0023634 -0.0001699 -0.3141875 -0.3747416 0.1037314 0.0042023 -0.0122499 -1.3541681 0.0000716 0.0044749 0.0070627 -0.4438258 -0.3747401 -0.1037132 0.0041935 0.0122721 -1.3541694 -0.0001818 0.004464 -0.0071198 -0.443827 -0.9994057 -0.1200981 -0.0432664 -0.1253053 -0.5150116 -0.0072408 -0.0430783 -0.0068099 -0.2864382 -0.9994198 0.1200918 -0.0431353 0.1252975 -0.5150061 0.0072252 -0.043045 0.0068055 -0.2864287 -0.4634108 0.0000131 -0.015749 0.0000104 -0.9497242 -0.0001074 -0.0155938 -0.000126 -0.1959413 -0.1908566 -0.5530165 -0.0183527 -0.3765411 -0.1028319 -0.0222428 -0.0182858 -0.0329617 0.1129576 -0.1908918 0.5530151 -0.0181856 0.3765446 -0.1028172 0.0222077 -0.0181688 0.0329624 0.1129743 0.6835285 -0.8842339 0.0460817 -0.245672 0.1724894 -0.0142377 0.0463354 -0.0519451 -0.1035267 0.6834912 0.8842386 0.0463213 0.2456763 0.1725112 0.0142936 0.0464136 0.0520049 -0.1035074 0.0012538 -0.0000198 -0.0120359 -0.0000158 1.0881567 0.0001136 -0.0121649 0.0001807 0.2074919 1.447772 0.4138241 0.0717088 0.2749452 1.7770964 0.0153428 0.0712908 0.0237605 0.2649065 1.4478053 -0.4138404 0.0714716 -0.2749612 1.7770832 -0.0151552 0.071191 -0.0235883 0.2648866 0.3535219 -0.0000036 0.0021854 -0.0000031 0.4688527 0.0000202 0.0018602 0.0000279 0.3184869 0.1415206 -0.0460049 -0.0167317 0.0239068 0.4025625 0.0014138 -0.0168365 -0.0029766 0.417262 0.1415184 0.0460019 -0.0167086 -0.0239112 0.4025636 -0.0014096 -0.0168174 0.002959 0.4172652 unknown
polarizability: 175.1957725|-0.0007462|164.6416399|7.6936206|0.0151358|45.8031176 unknown
InChI: InChI=1S/C7H3Cl2NO5/c8-1-3(6(12)13)10-4(7(14)15)2(9)5(1)11/h10,12,14H
charge 0 multiplicity 1
18 atoms
Cl 2.7562 -2.057762 0.161835
Cl -2.756277 -2.057812 -0.162211
O  -0.000012 -3.204609 -0.000446
O  1.990887 2.511864 0.117162
O  -1.991098 2.511824 -0.116594
O  3.61451 0.843037 0.216119
O  -3.614689 0.84297 -0.215632
N  -0.000091 0.928114 0.000245
C  1.219434 0.270983 0.072208
C  -1.219593 0.27096 -0.071908
C  1.240181 -1.123064 0.072978
C  -1.240292 -1.123087 -0.07305
C  -0.000045 -1.936794 -0.000094
C  2.414705 1.163579 0.143555
C  -2.41489 1.163534 -0.14306
H  -0.000106 1.956662 0.000329
H  2.779132 3.113576 0.164776
H  -2.779356 3.113524 -0.16411
