program: Gaussian 09
title: 000233259
version: EM64L-G09RevD.01
frameworkgroup: C1[X(C10H9I2NO5)]
method: RPBEPBE
basis: SDD
operation: Freq
keyword: #p
keyword: freq=noraman
keyword: PBEPBE/SDD
title: #p freq=noraman PBEPBE/SDD
converged: YES YES NO NO
title: Mulliken charges:
elementType: I I O O O O O N C C C C C C C C C C H H H H H H H H H
charge: 0.179969 0.179981 -0.222438 -0.222443 -0.207765 -0.191267 -0.191278 -0.217947 0.387131 0.387136 -0.578239 -0.578286 -0.629989 0.484376 0.053342 0.053377 -0.492636 -0.492639 0.272416 0.260478 0.272415 0.257759 0.245596 0.243798 0.243797 0.245598 0.257755
chargesum: 0.00000
title: Mulliken charges with hydrogens summed into heavy atoms:
elementType: I I O O O O O N C C C C C C C C C C
charge: 0.179969 0.179981 -0.222438 -0.222443 -0.207765 -0.191267 -0.191278 -0.217947 0.387131 0.387136 -0.578239 -0.578286 0.175320 0.484376 0.053342 0.053377 0.254516 0.254512
polarizability: 2.61885484e+02 -1.76670342e-02 2.08382536e+02 -3.17848783e-03 5.68706572e+00 9.90638705e+01
1716.lowfreq: -0.0006 -0.0005 -0.0004 2.0711 4.8814 9.3776 22.3550 30.5034 33.1842
frequency: 22.1910 30.4318 33.1816 36.3691 47.6483 70.0424 84.4269 84.7038 100.9114 103.2045 108.5895 120.0741 150.8415 178.4705 184.0407 192.0056 218.7875 247.2398 276.4637 280.2603 290.8697 322.2208 328.4745 381.7312 391.7157 466.7768 509.6091 582.6263 644.2202 644.3267 678.1258 706.9741 738.0100 756.7428 759.1528 817.2177 826.9146 882.6297 945.2423 990.0595 1078.1164 1082.9103 1114.2501 1114.9617 1115.8018 1150.7841 1151.6673 1170.1430 1204.6373 1204.7411 1310.0643 1404.5999 1422.6511 1422.9307 1446.3035 1454.1257 1454.2095 1461.2134 1461.3245 1478.4920 1500.8453 1518.5415 1547.1664 1582.8624 1622.3755 1628.0111 3009.1654 3009.2387 3011.2604 3114.2989 3114.3076 3116.0975 3140.2959 3161.3514 3161.3777
redmass: 1.2810 3.7463 5.2197 6.1752 5.3300 8.3003 3.6793 5.9427 1.3457 1.1876 4.7092 3.7056 7.1321 5.3530 13.8836 12.4507 6.1918 5.5355 7.9363 4.6183 6.6412 5.8095 3.7857 9.4697 11.1010 7.8806 4.5269 11.2686 10.7354 10.7253 10.7973 7.5816 6.3658 8.9454 11.5068 8.0008 8.3275 9.2837 7.7459 11.0708 2.1070 7.3469 1.2719 1.2958 1.3259 1.4281 1.4688 9.2441 9.4983 3.3633 7.2836 3.7409 1.2784 1.1975 1.1925 1.0499 1.0496 1.0507 1.0509 1.1451 1.0526 10.9993 11.6682 11.0211 10.1443 10.1449 1.0294 1.0294 1.0375 1.1051 1.1049 1.0989 1.1015 1.1051 1.1051
irintensity: 0.2781 0.0840 2.7704 1.0471 1.7802 3.1079 0.0005 0.1513 0.3890 0.0677 0.3674 4.2879 0.3765 0.1010 1.7057 0.4869 4.0529 11.6485 6.7992 19.3306 10.5951 3.0901 2.9913 3.5059 6.5409 7.4082 7.5333 17.1641 5.3147 18.8520 30.2808 4.1548 14.5329 0.6942 11.4681 3.3446 21.9593 9.9077 4.5950 17.3645 199.7968 326.3330 0.2498 7.5613 5.7117 8.2029 26.9993 185.6283 56.2397 87.1177 140.1464 0.3622 26.1609 19.3524 4.9908 6.0035 23.7426 0.2004 18.9491 23.5731 40.4977 9.3407 39.5744 193.2191 5.3977 331.3192 37.1832 17.1981 33.2481 5.1166 23.8023 6.2453 0.3421 0.7746 19.2673
temp: 298.150 k
press: 1.00000 atm
elementType: 53 53 8 8 8 8 8 7 6 6 6 6 6 6 6 6 6 6 1 1 1 1 1 1 1 1 1
symmnumber: 1
zpe: 467588.2 jmol-1
zpe.correction: 0.178095 hartree
zpe.thermalcorrener: 0.198659 hartree
zpe.thermalcorrenthalpy: 0.199603 hartree
zpe.thermalcorrgfe: 0.123084 hartree
zpe.sumelectzpe: -838.976917 hartree
zpe.sumelectthermal: -838.956354 hartree
zpe.sumelectthermalent: -838.955410 hartree
zpe.sumelectthermalfe: -839.031928 hartree
dipole: -0.0002 7.9226 -3.0264
dipole: 8.4810
quadrupole: -103.7815 -123.5491 -141.1945
quadrupole: -0.0020 0.0000 -10.4740
quadrupole: 19.0602 -0.7074 -18.3528 -0.0020 0.0000 -10.4740
hfenergy: -839.1550123 hartree
pointgroup: C01 [X(C10H9I2N1O5)]
dipole: -0.0002951 -3.2281212 -0.8441797 debye
polarizability: 261.8854788|-0.0241733|205.8553099|-0.0171175|-17.3847368|101.5911016 unknown
InChI: InChI=1S/C10H9I2NO5/c1-13-6(9(15)17-2)4(11)8(14)5(12)7(13)10(16)18-3/h1-3H3
charge 0 multiplicity 1
27 atoms
I  -3.066907 2.334114 -0.332945
I  3.067015 2.333806 -0.333822
O  -3.025498 -1.216571 -0.872631
O  3.024831 -1.217399 -0.873337
O  0.00007 3.329418 -0.596069
O  -2.965847 -1.169905 1.460371
O  2.965932 -1.170329 1.459672
N  -0.000016 -0.765175 0.307051
C  -1.20441 -0.074166 0.143238
C  1.204404 -0.074285 0.142925
C  -1.223831 1.280183 -0.151059
C  1.223885 1.280059 -0.151395
C  -0.000049 -2.236709 0.529546
C  0.000044 2.089992 -0.325278
C  -2.481624 -0.858966 0.349145
C  2.481593 -0.859204 0.34855
C  -4.346817 -1.899108 -0.819811
C  4.345883 -1.900475 -0.820834
H  0.886636 -2.519106 1.11478
H  -0.000156 -2.773683 -0.434883
H  -0.886643 -2.519045 1.114947
H  -5.098274 -1.206963 -0.405166
H  -4.286417 -2.801624 -0.189323
H  -4.570592 -2.150349 -1.864899
H  4.569105 -2.152201 -1.865923
H  4.285384 -2.802728 -0.189979
H  5.097801 -1.208478 -0.406775
