program: Gaussian 09
title: 000232765
version: EM64L-G09RevD.01
frameworkgroup: C1[X(C13H11F3N2O2S)]
method: RPBEPBE
basis: SDD
operation: Freq
keyword: #p
keyword: freq=noraman
keyword: PBEPBE/SDD
title: #p freq=noraman PBEPBE/SDD
converged: YES YES NO NO
title: Mulliken charges:
elementType: S F F F O O N N C C C C C C C C C C C C C H H H H H H H H H H H
charge: 0.917630 -0.165887 -0.171066 -0.165874 -0.531817 -0.513858 -0.557175 -0.684297 -0.108986 0.406862 -0.436033 0.320796 -0.207281 -0.197673 -0.365418 -0.364837 -0.179249 -0.385670 -0.397607 0.514694 0.264988 0.298791 0.289240 0.277323 0.291099 0.239075 0.265553 0.239744 0.232919 0.237594 0.319272 0.317148
chargesum: 0.00000
title: Mulliken charges with hydrogens summed into heavy atoms:
elementType: S F F F O O N N C C C C C C C C C C C C C
charge: 0.917630 -0.165887 -0.171066 -0.165874 -0.531817 -0.513858 -0.258384 -0.047877 -0.108986 0.406862 -0.146794 0.320796 0.070042 0.093426 -0.126343 -0.099284 0.060495 -0.152752 -0.160013 0.514694 0.264988
polarizability: 2.64397482e+02 -2.90597975e+01 2.30502516e+02 1.93618148e+01 7.34605897e+00 1.23924011e+02
1716.lowfreq: -3.6915 -1.1330 0.0003 0.0008 0.0012 5.8982 11.6057 12.8928 24.5272
frequency: 10.7592 12.8104 24.4777 36.2065 60.8037 71.2677 122.2268 129.6320 133.8367 176.2020 188.0080 193.9346 231.2779 286.5755 289.5755 307.3896 311.9311 330.8406 360.5066 394.4502 405.5181 413.2310 417.5445 418.9840 429.6092 443.8451 454.4634 491.7717 516.5107 522.7938 556.0797 603.9294 607.9979 622.4997 630.6974 689.5481 697.7541 717.7571 799.3098 804.7445 810.9958 816.9185 837.2260 840.8329 881.8979 914.5271 915.6368 944.5890 955.3411 972.4485 981.3609 983.2871 984.6877 986.8848 1009.7934 1023.2471 1051.7845 1054.1006 1103.6511 1132.3263 1182.7934 1185.2532 1204.2941 1226.5130 1294.8870 1300.4041 1313.4732 1325.5040 1395.6596 1400.6855 1438.8884 1449.4638 1474.0608 1489.6909 1582.3199 1585.5865 1613.3689 1615.3367 1650.4253 3133.8665 3137.5571 3140.1995 3156.2174 3163.6776 3167.4492 3172.3342 3177.5049 3360.3232 3561.1343 3699.4737
redmass: 9.8522 10.0580 7.0141 4.1761 7.3151 6.6760 7.3894 6.5825 7.1175 8.3684 7.0515 8.0477 9.0575 6.4203 6.3325 6.6327 8.1966 7.7019 7.1847 10.7706 3.2752 2.4612 1.1217 4.4325 5.5351 2.5186 1.7123 4.9928 7.4459 2.9264 7.0506 6.5979 11.0246 6.9053 6.3590 2.3236 4.9662 2.9301 8.7850 1.5426 5.0982 1.2967 1.7972 1.8588 3.4123 1.4150 1.6029 8.8633 1.3631 1.3515 4.7390 1.8266 4.1247 4.9866 5.8069 1.4379 2.5733 3.0411 1.7784 1.1924 1.1193 1.1084 2.4663 1.2031 5.1095 1.2969 1.2960 2.5685 7.3520 5.3159 3.8925 2.8316 2.5929 2.9964 7.3500 6.2505 5.9291 4.9633 1.2243 1.0888 1.0891 1.0889 1.0920 1.0958 1.0967 1.0927 1.0980 1.0750 1.0454 1.1040
irintensity: 2.2251 2.3012 2.4982 0.0783 0.9239 0.4051 1.1943 0.9947 0.8838 0.5399 3.6906 2.4163 11.5572 2.5896 22.6969 3.2643 4.9371 4.0287 2.8823 45.3010 4.2249 2.7407 2.0333 30.4911 6.2177 38.5633 418.8203 2.6021 0.9462 28.2746 3.4319 27.6735 16.5910 0.6689 5.8021 18.3790 11.7775 1.0495 67.3654 48.5429 40.7833 0.9931 85.1613 163.7500 53.1510 4.6092 21.3602 64.3012 0.6911 0.2858 5.9444 40.1294 12.0802 162.4835 127.2377 1.8858 66.5428 102.0416 8.6719 13.0790 10.2466 32.3727 64.4742 12.0454 232.5936 4.7570 4.0751 80.8024 0.5795 4.3749 1.8689 40.4235 9.6232 65.8787 7.4602 8.3369 72.3555 131.0412 277.1172 5.3479 12.4846 9.1814 10.0181 1.9591 9.6637 1.1074 6.2433 14.3192 129.9718 27.0429
temp: 298.150 k
press: 1.00000 atm
elementType: 16 9 9 9 8 8 7 7 6 6 6 6 6 6 6 6 6 6 6 6 6 1 1 1 1 1 1 1 1 1 1 1
symmnumber: 1
zpe: 578497.2 jmol-1
zpe.correction: 0.220338 hartree
zpe.thermalcorrener: 0.240404 hartree
zpe.thermalcorrenthalpy: 0.241348 hartree
zpe.thermalcorrgfe: 0.167966 hartree
zpe.sumelectzpe: -1457.848685 hartree
zpe.sumelectthermal: -1457.828619 hartree
zpe.sumelectthermalent: -1457.827674 hartree
zpe.sumelectthermalfe: -1457.901056 hartree
dipole: -2.0374 3.5669 -2.3662
dipole: 4.7405
quadrupole: -106.6839 -122.9982 -133.8526
quadrupole: -39.4385 7.7076 8.2605
quadrupole: 14.4943 -1.8199 -12.6744 -39.4385 7.7076 8.2605
hfenergy: -1458.0690227 hartree
pointgroup: C01 [X(C13H11F3N2O2S1)]
dipole: 0.8724008 1.6476824 -0.0503384 debye
polarizability: 262.6607537|21.5309111|196.3637637|-21.4060212|-54.8286371|159.7994917 unknown
InChI: InChI=1S/C13H11F3N2O2S/c14-13(15,16)9-2-1-3-11(8-9)18-21(19,20)12-6-4-10(17)5-7-12/h1-8,18H,17H2
charge 0 multiplicity 1
32 atoms
S  1.606462 -1.913182 0.604647
F  -2.793568 3.04763 0.660327
F  -1.644995 2.132227 -1.062442
F  -3.880813 1.776281 -0.863447
O  2.738587 -2.76508 1.408871
O  0.617673 -2.601053 -0.493839
N  0.542418 -1.158361 2.110222
N  4.083153 2.978212 -1.934554
C  2.365697 -0.411177 -0.171436
C  -0.809652 -0.852376 1.803528
C  -1.077424 0.290078 1.002209
C  -2.407977 0.636875 0.699226
C  3.502419 0.159346 0.432452
C  1.787243 0.102692 -1.348357
C  -1.89979 -1.62244 2.299379
C  -3.494434 -0.115237 1.210238
C  -3.227859 -1.239755 2.0205
C  4.078467 1.292244 -0.163513
C  2.366209 1.237933 -1.937473
C  3.516016 1.854013 -1.352847
C  -2.675773 1.863242 -0.125907
H  0.646407 -1.924262 2.804764
H  -0.243719 0.89739 0.637755
H  3.931459 -0.284247 1.336288
H  0.917562 -0.38904 -1.795984
H  -1.699441 -2.518801 2.898555
H  -4.522812 0.166889 0.966986
H  -4.058788 -1.832939 2.415088
H  4.966408 1.750094 0.286869
H  1.929953 1.654037 -2.852269
H  3.686575 3.388206 -2.775728
H  4.900136 3.42376 -1.52611
