program: Gaussian 09
title: 000022104
version: EM64L-G09RevD.01
frameworkgroup: C1[X(C16H18F3NO)]
method: RPBEPBE
basis: SDD
operation: Freq
keyword: #p
keyword: freq=noraman
keyword: PBEPBE/SDD
title: #p freq=noraman PBEPBE/SDD
converged: YES YES NO NO
title: Mulliken charges:
elementType: F F F O N C C C C C C C C C C C C C C C C H H H H H H H H H H H H H H H H H H
charge: -0.165018 -0.169778 -0.167822 -0.221544 -0.094965 -0.073107 -0.579251 -0.460697 -0.725420 0.529692 -0.638875 0.363235 -0.516489 -0.394936 0.299034 -0.211263 -0.385435 -0.427028 0.237774 -0.261636 -0.175506 0.227720 0.244036 0.208452 0.206851 0.229003 0.244697 0.214610 0.225080 0.222804 0.185979 0.248552 0.264109 0.247240 0.235494 0.267142 0.259194 0.251413 0.256661
chargesum: 0.00000
title: Mulliken charges with hydrogens summed into heavy atoms:
elementType: F F F O N C C C C C C C C C C C C C C C C
charge: -0.165018 -0.169778 -0.167822 -0.221544 -0.094965 0.154613 -0.126762 -0.024843 -0.041034 0.529692 0.018460 0.363235 -0.252381 -0.147696 0.299034 0.024231 -0.118293 -0.167834 0.237774 -0.010223 0.081154
polarizability: 2.47947379e+02 8.22030886e+00 1.51373264e+02 3.12018405e+00 -1.19287479e+01 1.42939084e+02
1716.lowfreq: -19.1913 -6.5887 -0.0012 -0.0011 -0.0009 3.4096 4.5692 13.4932 20.0989
frequency: -18.4039 13.4396 20.0480 30.8591 38.7430 72.3527 85.1390 102.5520 125.5641 142.6978 169.5581 208.7438 225.6107 228.1412 242.0860 274.9943 279.0827 300.8375 326.3377 340.9188 344.4378 386.7649 396.5517 427.7728 445.9933 492.3354 504.9965 520.9269 581.2934 594.2382 609.1611 620.3036 633.8753 698.2801 706.0807 725.9737 743.7783 771.0521 810.2479 819.7281 845.0247 858.7562 868.5067 873.5474 878.4697 897.6456 911.0518 932.0718 937.9373 978.3368 980.7957 989.2299 993.9759 1006.3182 1012.7495 1039.3832 1046.3815 1048.5807 1071.2003 1102.6342 1104.8744 1120.5219 1132.3194 1133.7939 1178.5831 1185.9941 1200.5448 1213.2472 1217.4137 1223.1175 1280.5227 1294.5287 1299.7986 1310.0029 1322.5189 1347.1426 1364.7553 1367.8638 1379.5219 1390.3898 1432.5925 1436.2310 1452.0746 1464.4432 1471.9188 1474.9514 1479.1016 1484.1620 1488.3735 1492.5002 1587.2937 1600.0130 1618.1101 2862.9955 2873.3211 2977.7792 2978.9398 2993.1048 3023.9905 3039.1715 3057.2521 3072.9552 3079.6869 3081.8320 3125.9547 3141.7822 3152.5887 3176.5674 3215.6708 3231.2101 3266.8355
redmass: 13.9672 5.8010 4.9133 5.3299 4.3068 3.7588 3.4281 3.8392 6.6724 4.7598 4.9408 2.1877 1.3038 1.6774 1.7754 3.9220 3.1126 6.4244 8.1456 2.8815 2.5132 3.0282 3.2458 4.1202 4.3572 3.2587 3.7092 7.5248 4.9032 3.2031 11.2133 4.9561 5.2929 4.4399 2.6165 1.2921 3.5673 2.7052 1.6398 1.3961 2.6278 2.6841 4.0003 1.6793 3.0684 1.6170 1.5959 1.4559 2.0087 1.9370 6.7441 6.1453 1.4250 6.3237 1.5543 2.1497 2.4766 2.3777 2.5928 1.5501 1.8673 1.9382 1.7901 1.6129 1.9102 1.1012 1.8807 1.5455 4.1205 1.5370 1.4546 2.2495 1.9569 1.3965 1.2832 1.3630 2.2732 1.3530 1.2276 7.7356 1.1559 2.9594 1.0851 1.0546 1.1142 1.1195 1.2642 1.6543 4.5215 1.0661 6.7093 6.2521 6.1580 1.0587 1.0682 1.0625 1.0534 1.0629 1.0728 1.0864 1.1020 1.0993 1.0992 1.1007 1.0887 1.0922 1.0925 1.0971 1.0928 1.0980 1.1083
irintensity: 0.0329 0.6178 0.1855 0.4736 0.3235 0.0744 0.3642 1.9164 0.1373 0.4026 1.0889 1.7494 0.7308 0.1198 0.8226 0.6605 5.5253 0.1422 6.8679 0.7969 1.7723 1.1746 6.6616 0.8426 1.5253 1.0024 7.7235 1.6748 7.9673 6.2400 14.8843 3.9839 0.7041 7.6244 23.0650 77.9780 22.4620 20.3114 49.4378 43.6324 6.9290 19.4432 6.1731 0.8135 6.7079 10.0261 13.1681 22.0986 13.9747 18.5148 184.1992 10.6318 8.5560 162.1220 38.0823 61.0053 27.9550 22.3665 61.8102 12.2283 6.8473 16.5630 73.6977 15.1361 22.6386 0.4064 78.7263 7.1932 7.3255 27.6794 22.9192 113.0391 117.4051 29.9287 3.4142 1.8456 4.9921 13.2884 36.3098 2.5669 9.8850 34.0818 3.6422 17.1751 1.0596 4.1397 22.5202 3.7539 7.6955 6.3569 3.4148 8.2145 6.6989 79.4087 112.2856 6.5983 20.1398 37.2429 35.8388 14.0429 12.1738 35.2307 39.1291 36.6696 7.9424 4.6678 10.0587 5.7178 5.4092 0.6520 0.9203
temp: 298.150 k
press: 1.00000 atm
elementType: 9 9 9 8 7 6 6 6 6 6 6 6 6 6 6 6 6 6 6 6 6 1 1 1 1 1 1 1 1 1 1 1 1 1 1 1 1 1 1
symmnumber: 1
zpe: 802903.3 jmol-1
zpe.correction: 0.305810 hartree
zpe.thermalcorrener: 0.325474 hartree
zpe.thermalcorrenthalpy: 0.326419 hartree
zpe.thermalcorrgfe: 0.254587 hartree
zpe.sumelectzpe: -1048.407133 hartree
zpe.sumelectthermal: -1048.387468 hartree
zpe.sumelectthermalent: -1048.386524 hartree
zpe.sumelectthermalfe: -1048.458356 hartree
dipole: -3.8103 2.4076 0.6955
dipole: 4.5605
quadrupole: -130.7070 -120.3831 -121.5913
quadrupole: 13.2761 -4.9379 -2.3779
quadrupole: -6.4798 3.8440 2.6358 13.2761 -4.9379 -2.3779
hfenergy: -1048.7129429 hartree
pointgroup: C01 [X(C16H18F3N1O1)]
dipole: -1.4764661 0.526199 0.873222 debye
polarizability: 248.2629181|4.6720892|159.5916395|4.3626627|2.4614702|134.4051688 unknown
InChI: InChI=1S/C16H18F3NO/c1-12(20(2)11-15-7-4-8-21-15)9-13-5-3-6-14(10-13)16(17,18)19/h3-8,10,12H,9,11H2,1-2H3
charge 0 multiplicity 1
39 atoms
F  6.055764 -0.230547 -0.662005
F  4.688895 -1.962262 -0.130565
F  4.616135 -1.066786 -2.20527
O  -4.340644 0.512888 -1.322691
N  -2.302763 -0.015372 0.989566
C  -0.814932 -0.09352 1.074976
C  -0.172879 0.372057 -0.271564
C  -2.939565 -0.996785 0.07345
C  -0.25904 -1.469902 1.533711
C  1.291715 0.749876 -0.126083
C  -2.976903 0.059917 2.29993
C  -4.293401 -0.562332 -0.405654
C  2.324958 -0.120037 -0.543982
C  1.656031 1.994157 0.457634
C  3.683636 0.242338 -0.37642
C  3.009606 2.355146 0.621664
C  4.03659 1.478833 0.206538
C  -5.584715 -1.008088 -0.165375
C  4.741425 -0.720536 -0.829835
C  -6.484083 -0.186648 -0.952115
C  -5.695414 0.720952 -1.636903
H  -0.531077 0.660954 1.83706
H  -0.763756 1.240567 -0.616567
H  -0.275887 -0.424335 -1.033078
H  -3.067398 -2.002104 0.545799
H  -2.27945 -1.132857 -0.801959
H  0.836692 -1.426114 1.665278
H  -0.478495 -2.257716 0.788882
H  -0.702059 -1.775863 2.498846
H  -2.535353 0.877859 2.896485
H  -2.912288 -0.882856 2.899237
H  -4.046356 0.288304 2.14842
H  2.071037 -1.081139 -1.005682
H  0.866333 2.686655 0.773834
H  3.26939 3.321059 1.067131
H  5.089002 1.751024 0.326788
H  -5.861149 -1.828899 0.494159
H  -7.568525 -0.262927 -0.999924
H  -5.898076 1.525541 -2.338112
