program: Gaussian 09
title: 000233239
version: EM64L-G09RevD.01
frameworkgroup: C1[X(C16H18O2)]
method: RPBEPBE
basis: SDD
operation: Freq
keyword: #pfreq=noraman
keyword: PBEPBE/SDD
title: #p freq=noraman PBEPBE/SDD
converged: YES YES NO NO
title: Mulliken charges:
elementType: O O C C C C C C C C C C C C C C C C H H H H H H H H H H H H H H H H H H
charge: -0.452198 -0.448730 0.030479 -0.233502 0.444327 0.330114 -0.398947 -0.697303 -0.341827 -0.356244 -0.426891 -0.435462 -0.245119 -0.252010 -0.250353 -0.230457 -0.244671 -0.243156 0.244251 0.223979 0.224478 0.362769 0.207620 0.219756 0.236141 0.255997 0.253631 0.230463 0.270529 0.353951 0.226707 0.228898 0.224592 0.228666 0.229107 0.230416
chargesum: 0.00000
title: Mulliken charges with hydrogens summed into heavy atoms:
elementType: O O C C C C C C C C C C C C C C C C
charge: -0.089429 -0.094779 0.030479 0.010749 0.444327 0.330114 0.049510 -0.033786 -0.085831 -0.102613 -0.196428 -0.164934 -0.018411 -0.023112 -0.025761 -0.001791 -0.015564 -0.012740
polarizability: 2.08288558e+02 1.38038952e+01 1.67333550e+02 -1.37260478e+01 4.27274411e+00 1.37525400e+02
1716.lowfreq: -9.5689 -0.9255 -0.0007 0.0005 0.0008 9.2146 22.2582 48.8375 66.2027
frequency: 21.9912 48.7305 66.1769 74.5592 96.0829 108.7761 156.3324 189.5426 220.0246 225.5357 256.6395 283.4147 294.2698 305.9587 329.4687 362.3844 392.1598 401.0754 407.5014 433.6220 466.3102 507.6022 571.8152 597.9121 612.9557 617.6919 628.9911 650.2467 699.8637 703.4157 712.7647 767.9105 771.8720 782.2924 851.0582 862.5874 865.2469 900.8723 920.4510 928.1529 949.5406 963.1904 976.6717 984.4910 989.8853 991.7284 995.1198 998.4632 1011.2917 1029.4466 1031.3139 1052.1709 1082.5429 1086.4517 1101.2876 1117.4908 1159.1724 1172.5566 1173.9206 1185.7677 1191.1601 1201.1693 1220.4178 1284.0333 1295.0853 1312.3574 1324.1057 1339.2293 1345.3442 1374.1869 1380.6391 1385.1570 1392.8372 1430.7630 1436.7112 1468.1064 1476.1843 1478.0502 1487.3619 1487.8795 1586.7059 1592.0215 1607.7370 1614.6219 2981.7412 2986.4260 3035.7345 3050.7542 3076.3358 3090.3072 3122.6814 3122.8513 3130.6701 3131.5030 3143.6632 3144.5602 3152.6732 3155.5263 3165.2693 3166.5763 3406.1738 3502.4132
redmass: 3.8070 4.0902 3.1591 4.2742 4.2136 3.0731 3.0574 2.3792 4.6663 1.6006 3.5623 3.6407 4.3013 5.6709 5.1368 3.4373 1.3720 2.6459 2.6215 3.4732 3.1497 3.0257 3.7858 2.1734 4.4097 6.0374 1.8568 4.0484 3.4568 1.7662 1.6594 1.5227 2.0916 1.8722 1.2488 1.3057 2.5336 2.2153 1.6643 1.6773 2.4123 3.3547 1.3997 1.4960 4.6087 4.9581 1.3601 1.3919 3.5418 2.2486 2.2101 1.6555 1.6967 1.6762 1.8413 2.3483 2.5743 1.0628 1.0537 1.7168 1.2534 1.1757 1.4732 1.4604 1.2461 1.3405 1.4006 1.4611 1.5867 4.8967 8.1712 1.2680 1.2008 2.1983 2.2359 1.0715 1.0817 2.0366 1.1528 1.9001 6.0452 6.0585 6.0332 6.0223 1.0362 1.0616 1.0930 1.0905 1.0994 1.1001 1.0846 1.0844 1.0879 1.0877 1.0933 1.0920 1.0958 1.0951 1.1013 1.0997 1.0643 1.0652
irintensity: 0.2852 0.0767 0.1349 0.2504 1.0891 1.7372 0.5438 2.1453 1.2535 3.1829 1.4138 2.0700 4.5627 3.7570 6.6561 5.2009 84.7814 6.1731 4.8068 3.6333 13.7776 3.6567 20.5557 17.7530 26.1975 0.8935 130.8780 42.9438 9.7850 49.2096 60.4961 6.5691 57.0435 24.4216 0.2365 4.6254 43.3189 7.2548 21.1326 15.9125 23.6157 20.2000 0.2543 0.2918 0.5216 1.1809 0.1168 0.3740 1.7355 5.4447 12.1443 31.4806 7.0299 6.8153 27.7864 1.9119 26.9163 0.4913 0.0487 4.6397 1.6430 1.2201 24.7740 22.0626 4.9125 13.6899 15.1339 86.5172 9.9480 3.7609 1.7176 13.2782 11.6841 13.0826 8.6991 5.8947 12.7018 8.1109 13.4629 12.4316 1.0272 0.2655 3.1260 1.5388 43.6439 12.5280 6.2125 20.8865 54.2419 27.0586 2.3144 0.7475 4.4605 2.2369 30.6871 27.8341 38.8644 21.1069 17.5833 15.5578 41.8839 6.4231
temp: 298.150 k
press: 1.00000 atm
elementType: 8 8 6 6 6 6 6 6 6 6 6 6 6 6 6 6 6 6 1 1 1 1 1 1 1 1 1 1 1 1 1 1 1 1 1 1
symmnumber: 1
zpe: 780111.7 jmol-1
zpe.correction: 0.297129 hartree
zpe.thermalcorrener: 0.313839 hartree
zpe.thermalcorrenthalpy: 0.314783 hartree
zpe.thermalcorrgfe: 0.252424 hartree
zpe.sumelectzpe: -769.622051 hartree
zpe.sumelectthermal: -769.605341 hartree
zpe.sumelectthermalent: -769.604396 hartree
zpe.sumelectthermalfe: -769.666755 hartree
dipole: -1.0017 0.0095 -2.7179
dipole: 2.8966
quadrupole: -95.0487 -104.8610 -110.3549
quadrupole: 3.4135 -4.0669 -0.7650
quadrupole: 8.3728 -1.4395 -6.9333 3.4135 -4.0669 -0.7650
hfenergy: -769.9191797 hartree
pointgroup: C01 [X(C16H18O2)]
dipole: 0.5979263 -0.1956081 0.9502368 debye
polarizability: 195.2258344|-15.0668997|171.062757|-28.6061747|5.4087179|146.8589165 unknown
InChI: InChI=1S/C16H18O2/c1-2-15(17)16(18,13-9-5-3-6-10-13)14-11-7-4-8-12-14/h3-12,15,17-18H,2H2,1H3
charge 0 multiplicity 1
36 atoms
O  -0.404034 0.678416 -2.197649
O  1.457555 2.402114 -1.292849
C  -0.073647 0.540992 -0.756639
C  0.427494 1.969589 -0.30979
C  -1.383078 0.09619 -0.08536
C  1.067174 -0.487159 -0.569043
C  0.944119 2.12537 1.131414
C  1.179085 3.605478 1.500882
C  -1.808106 -1.245707 -0.265253
C  1.322196 -1.076243 0.698091
C  -2.23107 0.979697 0.627848
C  1.912172 -0.827662 -1.655154
C  -3.037727 -1.69578 0.258483
C  2.401503 -1.967609 0.87761
C  -3.460051 0.53029 1.162482
C  2.996937 -1.718665 -1.476658
C  -3.869298 -0.809202 0.981482
C  3.249417 -2.288512 -0.208945
H  -0.392797 2.683343 -0.504576
H  0.21778 1.672599 1.832651
H  1.883927 1.550298 1.245814
H  0.224167 1.375344 -2.545884
H  0.229088 4.172531 1.499396
H  1.625791 3.697793 2.507171
H  1.8571 4.086024 0.773872
H  -1.172231 -1.935166 -0.8308
H  0.66169 -0.850586 1.542776
H  -1.954726 2.029505 0.770506
H  1.683618 -0.433834 -2.650208
H  2.266916 1.839974 -1.155692
H  -3.348613 -2.734624 0.10069
H  2.577121 -2.416411 1.861873
H  -4.099355 1.229035 1.713915
H  3.63467 -1.974937 -2.330428
H  -4.823695 -1.156194 1.39321
H  4.086411 -2.98209 -0.070838
