program: Gaussian 09
title: 000232728
version: EM64L-G09RevD.01
frameworkgroup: C1[X(C20H12N2O4)]
method: RPBEPBE
basis: SDD
operation: Freq
keyword: #p
keyword: freq=noraman
keyword: PBEPBE/SDD
title: #p freq=noraman PBEPBE/SDD
converged: YES YES NO NO
title: Mulliken charges:
elementType: O O O O N N C C C C C C C C C C C C C C C C C C C C H H H H H H H H H H H H
charge: -0.195622 -0.196173 -0.195632 -0.196155 -0.217091 -0.217092 0.175967 0.176472 0.175984 0.176448 0.110891 0.113276 0.110878 0.113279 -0.455299 -0.455292 -0.350040 -0.349899 -0.350042 -0.349896 -0.210579 -0.210706 -0.210577 -0.210710 0.059134 0.059123 0.265050 0.266497 0.265050 0.266501 0.269925 0.269607 0.269923 0.269608 0.239361 0.239234 0.239361 0.239237
chargesum: 0.00000
title: Mulliken charges with hydrogens summed into heavy atoms:
elementType: O O O O N N C C C C C C C C C C C C C C C C C C C C
charge: -0.195622 -0.196173 -0.195632 -0.196155 -0.217091 -0.217092 0.175967 0.176472 0.175984 0.176448 0.110891 0.113276 0.110878 0.113279 0.076248 0.076258 -0.080115 -0.080292 -0.080118 -0.080287 0.028782 0.028528 0.028784 0.028527 0.059134 0.059123
polarizability: 2.77508148e+02 3.72504358e-02 2.54937910e+02 -5.82418782e+01 1.45291016e-02 1.77188146e+02
1716.lowfreq: -0.0008 -0.0005 0.0002 2.2695 2.5533 7.7740 8.5398 11.7150 12.2187
frequency: 8.4818 11.7148 11.9136 30.0067 33.8446 81.7305 115.6620 137.9799 138.2956 162.9644 163.8301 200.2436 200.4601 222.5321 223.9960 246.5242 246.9261 284.9968 308.6670 326.0965 327.1629 369.8193 405.3153 411.4448 422.5045 455.6843 455.7620 523.1289 523.1379 537.5673 563.6589 602.8414 617.4106 659.3563 659.4134 677.3451 677.3509 696.8385 697.3695 711.0153 724.3995 779.3112 785.9681 786.0426 797.2633 803.1484 821.9607 822.2834 907.4061 907.5426 925.3401 927.2749 938.5034 949.6086 975.5690 975.6189 1006.9223 1006.9352 1015.0753 1015.9999 1071.5065 1071.7931 1091.0407 1097.1392 1152.1926 1167.8584 1170.5917 1171.4663 1171.5757 1202.5517 1205.6115 1283.9249 1284.0098 1308.9781 1312.7328 1313.4319 1325.8774 1364.9855 1365.2645 1416.1022 1416.1161 1429.2565 1430.0526 1454.3580 1454.3738 1454.6382 1454.7585 1614.3832 1614.4566 1619.3037 1619.3311 1634.3119 1634.5052 1680.9856 1681.1575 2295.9602 3007.0306 3007.5302 3063.0233 3063.4741 3140.2959 3140.2984 3153.7107 3153.7193 3165.3166 3165.3247 3175.1970 3175.2359
redmass: 6.5306 8.0959 7.7320 6.4194 6.6496 9.0097 6.8331 4.9882 4.9954 9.6158 10.1677 7.3806 7.0138 2.5391 2.5915 4.6569 4.4684 7.2789 5.5385 10.4270 8.5655 6.7190 3.6877 3.1301 5.1154 4.8600 4.8590 7.2120 7.2116 7.6210 10.2075 9.7030 8.9870 4.8290 4.8288 6.2655 6.2696 5.0572 5.3934 3.6589 3.0723 2.3801 5.3240 5.3355 1.7399 2.4127 3.9077 3.9454 1.3935 1.3925 3.2610 3.2840 7.6658 6.7892 1.4126 1.4125 1.3481 1.3480 2.0498 2.0238 2.6062 2.6200 2.8953 2.9590 3.4149 1.2180 1.2592 1.9981 2.0018 2.8858 3.0793 1.4791 1.4811 1.4556 1.2981 2.9447 3.5022 1.7563 1.6030 5.8353 5.8157 1.1169 1.1232 2.5296 2.5077 2.6923 2.7269 7.6777 7.6787 7.8069 7.8007 12.0619 12.1011 11.9900 12.0753 11.7459 1.0580 1.0582 1.1025 1.1023 1.0864 1.0864 1.0906 1.0906 1.0956 1.0956 1.1004 1.1004
irintensity: 0.3198 0.0127 0.3086 0.0009 2.2281 0.3207 10.0332 0.0580 0.0001 1.6354 5.1448 0.1625 0.2237 4.1342 5.0249 2.9877 4.3360 0.8406 3.2740 20.7963 14.3347 0.0084 5.7110 0.5918 4.5433 0.0496 0.0262 8.9025 6.9985 9.7624 1.3784 17.4560 46.6746 0.0038 0.0006 0.7416 0.5337 2.0191 21.6418 13.8780 124.7276 11.2158 0.0104 0.0112 53.9297 0.0886 0.9469 0.8527 0.0832 0.0063 61.2961 47.3890 9.8865 4.2944 4.0170 0.3438 0.0010 0.0037 1.0679 1.1384 25.4811 16.8878 32.1055 27.0888 20.1995 5.3049 3.1141 5.7407 3.7815 10.2714 9.2899 0.0598 0.0145 148.7454 11.8599 455.6284 165.1042 65.4033 80.9448 5.7140 2.7727 54.9369 61.4439 13.6356 7.6917 1.1662 2.8509 1.6621 0.8359 68.6108 51.0670 452.8296 345.6182 41.6636 54.0088 0.1283 11.3614 9.5552 0.0450 0.1046 1.7408 1.6305 5.5682 4.7452 6.1682 5.1109 24.3823 17.4104
temp: 298.150 k
press: 1.00000 atm
elementType: 8 8 8 8 7 7 6 6 6 6 6 6 6 6 6 6 6 6 6 6 6 6 6 6 6 6 1 1 1 1 1 1 1 1 1 1 1 1
symmnumber: 1
zpe: 714588.7 jmol-1
zpe.correction: 0.272172 hartree
zpe.thermalcorrener: 0.293588 hartree
zpe.thermalcorrenthalpy: 0.294532 hartree
zpe.thermalcorrgfe: 0.216536 hartree
zpe.sumelectzpe: -1177.959004 hartree
zpe.sumelectthermal: -1177.937589 hartree
zpe.sumelectthermalent: -1177.936645 hartree
zpe.sumelectthermalfe: -1178.014641 hartree
dipole: 0.0002 4.0786 -0.0008
dipole: 4.0786
quadrupole: -106.1583 -141.0063 -152.4684
quadrupole: -0.0078 -4.1583 -0.0050
quadrupole: 27.0527 -7.7953 -19.2574 -0.0078 -4.1583 -0.0050
hfenergy: -1178.2311766 hartree
pointgroup: C01 [X(C20H12N2O4)]
dipole: 0.0004274 1.6046501 0.0032558 debye
polarizability: 259.8748685|0.0879405|254.9376915|-69.6429961|0.1207403|194.8216444 unknown
InChI: InChI=1S/C20H12N2O4/c23-17-13-7-1-2-8-14(13)18(24)21(17)11-5-6-12-22-19(25)15-9-3-4-10-16(15)20(22)26/h1-4,7-10H,11-12H2
charge 0 multiplicity 1
38 atoms
O  -3.811683 -2.332747 1.268143
O  -2.252595 0.787039 -1.897943
O  3.812213 -2.330393 -1.276698
O  2.250909 0.779034 1.898479
N  -2.804533 -1.002099 -0.428633
N  2.803857 -1.005288 0.423692
C  -4.408511 0.058832 0.880856
C  -3.939413 0.997197 -0.071521
C  4.408941 0.059842 -0.881031
C  3.939204 0.995069 0.074112
C  -3.691409 -1.239424 0.664854
C  -2.906413 0.331445 -0.929129
C  3.691387 -1.23899 -0.670049
C  2.90565 0.326501 0.928857
C  -1.863039 -2.005544 -0.95528
C  1.861844 -2.010403 0.946214
C  -5.390942 0.4004 1.821955
C  -4.437084 2.307843 -0.114203
C  5.392184 0.404455 -1.820171
C  4.436919 2.305534 0.121531
C  -5.899344 1.725193 1.788831
C  -5.429696 2.664311 0.83557
C  5.90067 1.729087 -1.78223
C  5.430326 2.665084 -0.826246
C  -0.553274 -1.998437 -0.276096
C  0.55209 -1.999841 0.267051
H  -2.338344 -2.99756 -0.844536
H  -1.726786 -1.796621 -2.03234
H  2.33669 -3.00217 0.831329
H  1.725668 -1.805926 2.024134
H  -5.745722 -0.333173 2.552585
H  -4.06713 3.023659 -0.854849
H  5.747469 -0.32669 -2.552986
H  4.066445 3.018888 0.864288
H  -6.665453 2.029645 2.509868
H  -5.840347 3.679629 0.835068
H  6.667378 2.035862 -2.501645
H  5.841072 3.680355 -0.822027
