program: Gaussian 09
title: 000232760
version: EM64L-G09RevD.01
frameworkgroup: C1[X(C22H32O3)]
method: RPBEPBE
basis: SDD
operation: Freq
keyword: #pfreq=noraman
keyword: PBEPBE/SDD
title: #p freq=noraman PBEPBE/SDD
converged: YES YES NO NO
title: Mulliken charges:
elementType: O O O C C C C C C C C C C C C C C C C C C C C C C H H H H H H H H H H H H H H H H H H H H H H H H H H H H H H H H
charge: -0.232340 -0.416432 -0.242789 -0.384998 -0.386447 -0.385591 -0.388487 -0.381549 -0.366963 -0.373174 -0.389922 -0.353170 -0.574482 -0.356793 0.509984 -0.696445 -0.425408 -0.411013 -0.334986 -0.354560 0.299174 0.099417 -0.212268 -0.262444 0.154934 0.194592 0.193933 0.194768 0.194343 0.193138 0.193460 0.196881 0.196405 0.191930 0.192376 0.195110 0.195278 0.189536 0.189332 0.212388 0.214858 0.187825 0.187636 0.211854 0.213355 0.194765 0.194707 0.209667 0.209735 0.215137 0.239232 0.239916 0.223315 0.277410 0.247964 0.293902 0.382010
chargesum: 0.00000
title: Mulliken charges with hydrogens summed into heavy atoms:
elementType: O O O C C C C C C C C C C C C C C C C C C C C C C
charge: -0.232340 -0.034422 -0.242789 0.003527 0.002663 0.001006 0.004799 0.002756 0.023425 0.005693 0.037324 0.022291 -0.149274 0.032678 0.509984 -0.061906 -0.186175 -0.171097 -0.111671 -0.077151 0.299174 0.099417 0.035696 0.031458 0.154934
polarizability: 4.12837736e+02 -5.16936811e+01 2.09027002e+02 -2.54780067e+01 -1.98281393e+01 2.03020417e+02
1716.lowfreq: -4.8962 -0.0021 0.0014 0.0018 2.5409 3.7260 10.4897 13.4689 24.1948
frequency: 8.0341 13.3468 24.0961 28.8447 30.5281 39.6711 44.5944 52.4322 62.6417 70.8115 83.0742 91.4162 99.9961 105.9242 125.9266 131.9673 140.1514 148.2459 151.8624 154.3239 155.0519 192.0108 196.3092 226.1593 231.9052 262.8307 282.7122 305.8927 333.9341 350.3326 391.4906 400.7136 409.3001 440.1006 476.1655 493.2134 514.8487 527.8502 572.5469 582.9040 629.3148 633.6009 652.4096 716.8020 720.1846 721.7993 726.5561 736.8332 756.0446 759.0921 784.2112 789.6248 821.4350 831.7209 842.0474 868.3651 882.9514 888.0337 919.2382 934.8553 936.8181 965.4534 980.2938 981.5900 985.2245 1000.6926 1002.8282 1003.8607 1013.8586 1017.9582 1020.8607 1027.3682 1047.3741 1059.8551 1066.4148 1073.7461 1078.1182 1079.6445 1081.2045 1084.4377 1122.8984 1132.0709 1180.9650 1194.1637 1199.6882 1200.5038 1202.8897 1222.8325 1225.8189 1231.0019 1250.2679 1251.5463 1257.3466 1270.9944 1279.1253 1281.9702 1283.1904 1288.3429 1291.5250 1295.0200 1297.7906 1298.1773 1305.5780 1324.6890 1326.2449 1334.8902 1339.8935 1351.0313 1354.7460 1358.0313 1358.3484 1383.2864 1388.4206 1415.7982 1459.6744 1459.7453 1462.5264 1462.9476 1465.0725 1467.0063 1471.3426 1475.8926 1476.1897 1480.6429 1484.9416 1487.9879 1489.4370 1501.3191 1523.8291 1573.5708 1616.6929 1630.5855 1654.0036 2949.6680 2949.9205 2951.2916 2952.0708 2952.9335 2955.8455 2960.2573 2964.6769 2968.6308 2971.1266 2971.6480 2982.5257 2982.8200 2985.3442 2989.3543 2995.0054 3002.8264 3011.7562 3020.2273 3027.9063 3035.9955 3042.9673 3052.5588 3068.3518 3070.0554 3124.9337 3127.2616 3148.7203 3158.6992 3163.9656 3166.7495 3520.3937
redmass: 5.9982 4.9633 4.3566 4.2451 6.0028 1.7083 5.1698 3.2369 1.7692 3.8227 4.3654 2.2007 1.9485 5.4283 1.9260 2.0950 4.5086 4.0208 2.0120 2.8202 2.1198 5.0660 3.8776 1.1409 5.4227 4.0216 6.0194 4.3137 3.4998 3.4441 3.6978 2.8087 3.3507 4.4046 3.1381 3.0558 4.3887 3.0317 1.6409 5.3083 4.8047 6.7320 1.9341 4.5409 1.0582 1.0664 1.0791 1.1014 1.1445 4.0029 5.4659 1.1915 4.3561 1.2343 1.5080 1.5371 1.2533 1.9013 2.2768 1.3626 2.9769 1.4983 3.4951 5.1037 1.2609 4.4007 1.2211 1.2374 3.4715 2.9347 3.4613 1.1143 3.2991 2.0016 2.8581 2.6811 1.4174 2.0745 2.1619 2.3753 2.8410 1.2846 1.8985 1.1426 1.4938 1.4657 1.3184 2.1899 1.4423 1.3581 1.5270 1.8162 1.3443 1.2422 1.0251 1.2899 1.1257 1.1181 1.1037 1.3863 1.1794 1.1062 1.3566 1.3851 2.5816 1.4258 1.4347 1.5323 1.6943 1.6355 1.6281 4.4236 1.2181 3.5438 1.0750 1.0743 1.0732 1.0705 1.0658 1.0856 1.0868 1.0703 1.0579 1.0898 1.0942 1.0977 1.0962 2.5795 10.1563 6.8936 6.3496 8.6097 6.3866 1.0585 1.0586 1.0589 1.0591 1.0593 1.0594 1.0592 1.0586 1.0583 1.0587 1.0369 1.0961 1.0590 1.0970 1.0983 1.1002 1.1020 1.1032 1.1038 1.1045 1.1048 1.1046 1.1048 1.1007 1.0993 1.0888 1.0891 1.0940 1.0942 1.0948 1.0896 1.0641
irintensity: 0.1540 0.1170 0.0157 0.0602 0.5611 0.1426 1.2135 0.1551 0.1190 0.8488 0.5615 0.0232 0.1175 1.7238 0.0121 0.0842 1.1684 0.0515 0.0673 0.7463 0.0950 5.1304 0.0004 0.0014 0.0446 0.4058 0.6277 0.8840 0.1423 4.1842 3.9213 0.0773 1.4292 2.4667 0.9708 0.1069 76.1094 4.6398 99.6829 41.4039 7.2990 0.6535 42.3738 51.3430 19.0204 0.0325 6.2722 0.0142 1.6348 22.9884 16.0131 0.3674 5.0291 0.5810 7.5484 24.0893 0.8179 5.0327 0.1667 0.2343 0.3946 1.2473 2.3064 0.0328 0.8415 2.1904 34.0957 19.8702 2.0815 20.8225 18.9888 0.7198 2.2734 427.9329 0.4887 0.7759 10.4851 1.8330 0.0612 0.1934 25.2643 8.6134 0.2582 68.5223 10.8679 4.3700 25.5230 2.6727 0.2592 4.7262 40.3920 82.7557 1.4817 0.6884 0.1955 0.6590 0.8208 2.0230 0.7421 37.4388 8.7680 0.8662 2.0227 4.6686 388.6491 56.7975 1.5940 0.7582 0.5809 0.0740 0.2174 23.8292 11.1539 28.8231 0.0051 0.0171 0.1343 0.2712 0.8664 0.2500 1.5856 4.2592 8.1852 1.9868 0.2590 4.4116 43.7980 3.2738 185.4759 26.1580 150.1073 183.9941 3.6007 0.0644 0.0650 0.7956 0.8766 1.6022 4.7128 0.0913 87.6411 181.6141 47.9513 35.8814 0.0242 79.9521 0.0970 0.2161 0.3048 0.4456 0.0980 1.2019 3.1594 2.5481 202.6734 135.6487 99.0841 56.0530 11.7692 20.1322 1.3493 13.0722 5.8388 1.2694 56.7878
temp: 298.150 k
press: 1.00000 atm
elementType: 8 8 8 6 6 6 6 6 6 6 6 6 6 6 6 6 6 6 6 6 6 6 6 6 6 1 1 1 1 1 1 1 1 1 1 1 1 1 1 1 1 1 1 1 1 1 1 1 1 1 1 1 1 1 1 1 1
symmnumber: 1
zpe: 1282671.1 jmol-1
zpe.correction: 0.488544 hartree
zpe.thermalcorrener: 0.517189 hartree
zpe.thermalcorrenthalpy: 0.518134 hartree
zpe.thermalcorrgfe: 0.422060 hartree
zpe.sumelectzpe: -1081.289455 hartree
zpe.sumelectthermal: -1081.260810 hartree
zpe.sumelectthermalent: -1081.259865 hartree
zpe.sumelectthermalfe: -1081.355939 hartree
dipole: 3.3572 -0.1530 -1.5975
dipole: 3.7210
quadrupole: -168.7041 -152.8967 -157.2767
quadrupole: -10.5686 8.2144 1.3178
quadrupole: -9.0783 6.7291 2.3491 -10.5686 8.2144 1.3178
hfenergy: -1081.7779991 hartree
pointgroup: C01 [X(C22H32O3)]
dipole: 1.3221304 0.0375732 0.6275134 debye
polarizability: 412.7290116|51.0275863|210.8571833|27.1371242|-19.5688359|201.2989603 unknown
InChI: InChI=1S/C22H32O3/c1-2-3-4-5-6-7-8-9-10-11-12-19-13-15-20(16-14-19)21(23)17-18-22(24)25/h13-18,24H,2-12H2,1H3
charge 0 multiplicity 1
57 atoms
O  -6.500845 0.946184 -1.838508
O  -10.093575 -2.26853 -0.479737
O  -8.501688 -2.753059 1.14976
C  5.451436 -0.155353 -0.019752
C  4.384815 0.79916 0.562696
C  6.900561 0.269389 0.308642
C  2.938424 0.385971 0.20771
C  7.964612 -0.691016 -0.268901
C  1.868927 1.330365 0.801553
C  9.415421 -0.259701 0.043574
C  0.429307 0.934513 0.405943
C  10.478202 -1.222853 -0.531831
C  -0.645751 1.873123 1.028313
C  11.929801 -0.787556 -0.226465
C  -2.05168 1.501209 0.593538
C  12.984446 -1.755967 -0.804555
C  -2.799341 0.522642 1.299775
C  -2.638372 2.085491 -0.563461
C  -4.082946 0.132908 0.869461
C  -3.918226 1.703998 -0.997616
C  -4.66405 0.718598 -0.290727
C  -6.020948 0.364382 -0.811044
C  -6.820821 -0.69365 -0.112363
C  -8.065367 -1.037583 -0.54723
C  -8.85039 -2.086995 0.143598
H  5.274061 -1.181445 0.365265
H  5.328584 -0.212298 -1.121747
H  4.49473 0.841836 1.666647
H  4.572834 1.828514 0.191766
H  7.079816 1.29263 -0.083209
H  7.023953 0.333046 1.41023
H  2.753926 -0.64826 0.566044
H  2.828165 0.356041 -0.896459
H  7.83369 -0.762987 -1.369129
H  7.791774 -1.712238 0.131019
H  2.069076 2.369338 0.46543
H  1.959063 1.338583 1.908089
H  9.546887 -0.18452 1.143567
H  9.589137 0.7601 -0.359784
H  0.226958 -0.108477 0.722751
H  0.32858 0.95009 -0.697924
H  10.309239 -2.242039 -0.124932
H  10.344956 -1.302301 -1.631319
H  -0.418546 2.915402 0.731007
H  -0.560364 1.824417 2.131469
H  12.097457 0.230422 -0.634131
H  12.062405 -0.707412 0.872006
H  12.856338 -2.773944 -0.390164
H  12.893952 -1.829335 -1.904945
H  14.012838 -1.423251 -0.571665
H  -2.369129 0.064991 2.198711
H  -2.080013 2.848012 -1.119822
H  -4.622105 -0.622179 1.449731
H  -4.376862 2.15348 -1.884671
H  -6.412678 -1.213033 0.761212
H  -8.510207 -0.544657 -1.41779
H  -10.601665 -2.977097 0.000974
