program: Gaussian 09
title: 000232830
version: EM64L-G09RevD.01
frameworkgroup: C1[X(C20H26N4O2S)]
method: RPBEPBE
basis: SDD
operation: Freq
keyword: #p
keyword: freq=noraman
keyword: PBEPBE/SDD
title: #p freq=noraman PBEPBE/SDD
converged: YES YES NO NO
title: Mulliken charges:
elementType: S O O N N N N C C C C C C C C C C C C C C C C C C C C H H H H H H H H H H H H H H H H H H H H H H H H H H
charge: 0.158757 -0.268312 -0.296320 -0.371911 -0.366451 -0.378094 -0.379337 -0.316308 -0.341700 -0.708624 -0.685036 -0.508594 -0.507190 0.251078 0.242379 0.430193 0.421028 -0.408060 -0.374382 -0.362602 -0.359882 -0.211397 -0.214697 -0.253701 -0.206642 -0.279740 -0.266492 0.218767 0.265357 0.226295 0.251218 0.239103 0.307291 0.282454 0.244406 0.222712 0.201422 0.200539 0.240901 0.316687 0.317387 0.318250 0.351003 0.229601 0.251463 0.290171 0.224035 0.226330 0.222210 0.239703 0.219954 0.230068 0.224710
chargesum: 0.00000
title: Mulliken charges with hydrogens summed into heavy atoms:
elementType: S O O N N N N C C C C C C C C C C C C C C C C C C C C
charge: 0.158757 -0.268312 -0.296320 -0.055224 -0.049064 -0.059844 -0.028334 0.167815 0.135813 -0.162231 -0.158176 -0.084460 -0.065750 0.251078 0.242379 0.430193 0.421028 -0.178459 -0.122918 -0.072431 -0.135846 0.014933 0.007513 -0.013998 0.013312 -0.049673 -0.041782
polarizability: 3.19230031e+02 -4.11296133e+00 2.29685046e+02 1.07287149e+01 -6.76831425e-01 2.53108439e+02
1716.lowfreq: -4.9671 -2.5025 -0.0011 -0.0006 0.0011 8.2908 11.4340 23.0259 27.0103
frequency: 10.6943 22.6403 26.9903 37.3132 37.9123 45.1525 52.4355 56.8086 61.4913 71.4607 78.7192 88.8599 105.6925 121.3580 179.3908 187.7801 195.1725 201.8756 211.8552 215.2084 231.8727 244.6785 257.5946 267.5629 285.8456 303.5389 309.0506 386.2136 394.6650 407.2093 407.7691 409.6606 449.1256 470.8425 476.3637 505.5846 509.5652 519.6304 539.1018 586.8870 589.5808 611.6851 613.1663 637.5910 640.6626 658.3193 675.4789 692.6232 694.5298 699.5522 711.6737 745.2714 754.5774 760.2122 774.1760 822.6886 824.5971 829.5847 835.2060 866.7459 870.4834 886.1804 891.9795 907.6398 917.0056 961.8290 963.4881 978.3405 980.4123 981.6080 981.8562 984.0070 992.8258 1011.1968 1020.3059 1025.2910 1030.2189 1048.5356 1065.6667 1083.3715 1084.7937 1111.5469 1129.3944 1146.3802 1161.7875 1169.2175 1170.9321 1179.7143 1184.3952 1187.4261 1190.6738 1237.3149 1241.4023 1255.8036 1262.9169 1275.0996 1288.9469 1291.6475 1305.3677 1319.5115 1322.0541 1326.3642 1335.4032 1336.9557 1365.3749 1381.3478 1383.2284 1425.0647 1427.2832 1440.1199 1447.5275 1449.6102 1450.3504 1456.7278 1457.5620 1465.2007 1482.8388 1484.0480 1487.0842 1507.2854 1517.1360 1589.7142 1590.6062 1604.6970 1607.8724 1621.5772 1621.7631 2980.3348 2981.8862 2994.1985 3010.2927 3017.1763 3018.9381 3041.5401 3041.9842 3058.9342 3070.4344 3094.5766 3103.5025 3121.3860 3123.8055 3126.5902 3129.9206 3142.6768 3145.1014 3151.1341 3162.5970 3167.1886 3172.0072 3465.1514 3504.8456 3519.5918 3525.7573
redmass: 6.0040 7.0026 5.5229 6.6727 6.1771 5.3473 4.8022 4.5399 4.6510 4.2505 4.4066 4.0089 2.9810 3.7714 3.8453 3.4743 3.6022 4.4156 3.2391 2.0895 3.8071 4.0634 3.2995 3.0352 3.5023 3.2040 3.3999 4.2504 3.7712 2.9151 2.9289 3.0262 1.8305 2.5144 3.0769 2.8228 2.8793 1.3694 1.4073 4.5058 3.4992 6.0995 5.8224 3.0641 4.2266 3.6225 3.5294 2.0419 2.0453 3.3270 2.5219 1.5677 1.6996 1.6367 1.5440 2.2149 3.0511 1.7039 1.3496 2.2635 2.1890 1.4769 1.5039 3.1826 3.4442 1.3642 1.4083 2.2224 2.0067 3.5143 2.1535 1.5135 2.6464 2.2083 2.2147 2.1624 2.1404 2.3445 2.7842 1.6730 1.6545 1.6721 2.5893 1.4784 1.5666 1.0478 1.0556 1.2696 1.1146 1.1084 1.5066 1.5289 1.7917 1.3964 1.2773 1.2241 1.2644 2.2323 2.1567 1.3984 1.4667 1.4003 1.4077 1.3986 1.3050 4.2066 4.0554 2.1544 2.0870 1.0896 1.1246 1.5370 1.1395 1.2572 2.0293 1.1004 1.1926 1.8984 2.3519 1.5700 1.5485 5.8172 6.2241 5.1651 5.8732 6.0594 6.1106 1.0598 1.0594 1.0612 1.0589 1.0635 1.0611 1.1013 1.1002 1.1015 1.1011 1.1048 1.1050 1.0854 1.0842 1.0884 1.0876 1.0939 1.0920 1.0959 1.0964 1.1013 1.0973 1.0776 1.0767 1.0787 1.0786
irintensity: 0.0543 1.0942 3.2756 0.5357 3.9804 1.5054 2.3869 1.6196 2.0125 1.8492 7.3804 4.2512 1.0967 4.2972 1.5311 2.0345 3.3961 9.5148 9.6816 20.6070 1.4237 7.5373 2.1614 1.0316 3.2391 3.4190 1.1848 16.1354 46.2011 5.7271 19.8080 35.6065 58.6835 44.3574 24.1528 18.7268 28.7653 87.5683 80.5074 20.4119 22.5827 2.0742 4.2716 37.9518 18.0159 4.3272 3.9231 24.4035 47.6667 2.4203 9.2967 4.4266 74.1546 114.0624 10.8712 2.8626 12.5986 4.2771 2.6573 3.9645 8.3848 17.0113 7.4114 14.9403 10.6679 0.0132 0.8648 5.0610 2.7804 2.1055 0.2413 0.5685 2.0915 1.6410 3.9014 5.1185 20.5323 15.2055 1.6965 10.7257 3.6977 35.6037 40.4871 8.6453 11.9219 0.8555 1.3406 7.3551 9.2788 9.1989 11.9599 39.6402 21.4600 44.5311 14.9964 2.1321 18.0488 22.1975 2.8551 9.0799 11.2992 9.8971 4.8519 3.0351 0.5005 14.5357 64.2930 15.7321 74.0328 1.1603 19.5812 41.8552 18.1796 34.2387 68.0088 39.7018 25.6237 88.1263 82.1848 35.5469 25.8240 20.3353 151.3768 89.2358 184.3504 51.0260 70.1550 31.2424 24.1214 27.7127 13.1517 36.9419 14.5275 10.0620 36.2171 6.5009 2.7247 32.8903 9.9061 7.8515 4.5705 4.1742 7.6034 25.6332 11.4892 30.1146 20.2934 21.1475 4.7054 133.1933 28.3253 44.2276 42.6361
temp: 298.150 k
press: 1.00000 atm
elementType: 16 8 8 7 7 7 7 6 6 6 6 6 6 6 6 6 6 6 6 6 6 6 6 6 6 6 6 1 1 1 1 1 1 1 1 1 1 1 1 1 1 1 1 1 1 1 1 1 1 1 1 1 1
symmnumber: 1
zpe: 1134313.2 jmol-1
zpe.correction: 0.432037 hartree
zpe.thermalcorrener: 0.459712 hartree
zpe.thermalcorrenthalpy: 0.460656 hartree
zpe.thermalcorrgfe: 0.369936 hartree
zpe.sumelectzpe: -1543.207934 hartree
zpe.sumelectthermal: -1543.180259 hartree
zpe.sumelectthermalent: -1543.179315 hartree
zpe.sumelectthermalfe: -1543.270035 hartree
dipole: -0.7392 -0.2673 2.9938
dipole: 3.0953
quadrupole: -172.1517 -149.4758 -164.6897
quadrupole: 3.1525 11.2276 7.8166
quadrupole: -10.0460 12.6300 -2.5840 3.1525 11.2276 7.8166
hfenergy: -1543.6399713 hartree
pointgroup: C01 [X(C20H26N4O2S1)]
dipole: -0.5245415 0.0692548 1.0968494 debye
polarizability: 235.863947|7.0349912|319.681304|-10.3300753|-7.0710252|246.4782656 unknown
InChI: InChI=1S/C20H26N4O2S/c25-19(23-21-17-9-3-1-4-10-17)13-7-15-27-16-8-14-20(26)24-22-18-11-5-2-6-12-18/h1-6,9-12,21-24H,7-8,13-16H2
charge 0 multiplicity 1
53 atoms
S  0.995305 4.634941 -2.073569
O  2.784933 0.175284 -1.089969
O  -0.619919 1.641503 1.193201
N  3.017145 -0.167049 1.192525
N  -2.521943 0.916869 0.076367
N  2.751822 -1.542478 1.108536
N  -2.199911 -0.447497 0.178936
C  2.399834 3.121955 -0.064447
C  -1.106798 4.248495 -0.145457
C  2.242066 3.286092 -1.587162
C  -0.616548 3.792173 -1.534907
C  3.491909 2.081966 0.326729
C  -2.236029 3.339307 0.412954
C  3.05904 0.641705 0.0577
C  -1.714125 1.912563 0.601349
C  1.575766 -2.075149 1.695988
C  -1.984678 -1.196292 -1.011671
C  1.372531 -3.48281 1.63907
C  -1.521464 -2.53501 -0.885348
C  0.643996 -1.260075 2.394445
C  -2.2781 -0.673908 -2.298795
C  0.258077 -4.062476 2.277989
C  -1.356189 -3.330396 -2.035165
C  -0.459751 -1.860296 3.043288
C  -2.113614 -1.488521 -3.441405
C  -0.663847 -3.259599 2.994264
C  -1.65587 -2.819344 -3.322084
H  2.67854 4.099855 0.372897
H  1.440774 2.815407 0.391975
H  -1.464742 5.293445 -0.195773
H  -0.264991 4.23107 0.567207
H  3.187693 3.620584 -2.051682
H  1.938723 2.342007 -2.067322
H  -0.418166 2.706158 -1.558097
H  -1.356989 4.022226 -2.321184
H  4.41364 2.276505 -0.255884
H  3.745769 2.215196 1.396396
H  -3.118425 3.353304 -0.257069
H  -2.560103 3.730379 1.396722
H  3.376793 0.163736 2.090635
H  -3.466837 1.129625 -0.252184
H  3.080167 -1.952375 0.228295
H  -1.597967 -0.655947 0.985154
H  2.095819 -4.114914 1.109966
H  -1.291566 -2.940092 0.106714
H  0.757823 -0.172155 2.3943
H  -2.603831 0.365198 -2.412869
H  0.116451 -5.148167 2.228198
H  -0.991328 -4.358131 -1.925092
H  -1.16412 -1.223818 3.592496
H  -2.336121 -1.072326 -4.430787
H  -1.519398 -3.715489 3.502894
H  -1.527045 -3.444429 -4.211764
