program: Gaussian 09
title: 000022070
version: EM64L-G09RevD.01
frameworkgroup: C1[X(C4H8Cl2OS)]
method: RPBEPBE
basis: SDD
operation: Freq
keyword: #p
keyword: freq=noraman
keyword: PBEPBE/SDD
title: #p freq=noraman PBEPBE/SDD
converged: YES YES NO NO
title: Mulliken charges:
elementType: Cl Cl S O C C C C H H H H H H H H
charge: -0.050335 -0.050349 0.628357 -0.625598 -0.535654 -0.535591 -0.549433 -0.549425 0.286515 0.267361 0.267363 0.286489 0.309076 0.271073 0.271079 0.309071
chargesum: 0.00000
title: Mulliken charges with hydrogens summed into heavy atoms:
elementType: Cl Cl S O C C C C
charge: -0.050335 -0.050349 0.628357 -0.625598 0.018222 0.018261 0.030716 0.030725
polarizability: 1.37327792e+02 4.95307542e-03 7.83653203e+01 -2.17006919e-03 -4.71636483e+00 6.01768009e+01
1716.lowfreq: -8.4387 -0.0030 -0.0027 0.0024 4.5413 15.9814 25.4652 26.7154 60.6423
frequency: 24.6793 26.7051 60.5782 74.2904 93.3246 163.4503 180.4596 209.9842 267.5224 321.5949 360.0755 537.2821 568.3337 674.1634 680.9626 772.7923 774.1560 800.0183 930.1253 961.8955 1053.5283 1075.7473 1084.8348 1098.8751 1184.4932 1218.0984 1258.6015 1270.1749 1279.7432 1290.1213 1418.1238 1430.2194 1464.6924 1465.2131 3045.0902 3046.1453 3065.0932 3065.2802 3132.2673 3134.0558 3156.9822 3157.7215
redmass: 2.2301 3.8658 6.8715 3.5538 3.9897 5.5099 9.2401 7.2133 4.6488 4.6696 11.1581 5.5967 7.4122 6.4924 5.9958 2.6477 1.1245 1.7347 1.2987 1.4263 4.1755 4.0148 1.0736 1.0908 1.1574 1.1612 1.2066 1.1953 1.1743 1.1811 1.1051 1.1080 1.0939 1.0943 1.0562 1.0562 1.0558 1.0558 1.1104 1.1102 1.1124 1.1120
irintensity: 2.6403 2.0571 0.0929 1.0801 13.2865 19.7086 1.3313 3.9552 2.4564 6.8938 25.3313 1.5709 3.5112 53.5788 18.6207 29.0571 1.5539 31.1134 0.8007 0.1627 33.2275 0.3494 3.9268 2.0668 0.0381 8.3138 0.5039 2.5872 1.6422 20.6344 5.8799 7.4340 1.3173 18.9001 1.9198 5.6723 6.5688 12.3405 0.5922 2.2412 0.0746 13.6833
temp: 298.150 k
press: 1.00000 atm
elementType: 17 17 16 8 6 6 6 6 1 1 1 1 1 1 1 1
symmnumber: 1
zpe: 304315.0 jmol-1
zpe.correction: 0.115907 hartree
zpe.thermalcorrener: 0.127002 hartree
zpe.thermalcorrenthalpy: 0.127946 hartree
zpe.thermalcorrgfe: 0.075141 hartree
zpe.sumelectzpe: -1549.888262 hartree
zpe.sumelectthermal: -1549.877167 hartree
zpe.sumelectthermalent: -1549.876223 hartree
zpe.sumelectthermalfe: -1549.929028 hartree
dipole: 0.0000 -0.7613 3.4846
dipole: 3.5668
quadrupole: -84.6593 -74.3347 -69.8510
quadrupole: -0.0004 0.0004 3.2319
quadrupole: -8.3776 1.9470 6.4306 -0.0004 0.0004 3.2319
hfenergy: -1550.0041693 hartree
pointgroup: C01 [X(C4H8Cl2O1S1)]
dipole: -0.0037519 0.9317961 -1.049259 debye
dipolederiv: -0.7074659 -0.1260277 -0.1244882 -0.1349792 -0.2041695 -0.0581413 -0.2333431 -0.0670675 -0.2177455 -0.7061813 0.1247018 0.1272475 0.1336543 -0.2036629 -0.058602 0.236143 -0.0672811 -0.219687 0.3656426 -0.0005624 -0.0005224 -0.0000097 0.8024548 0.2103004 -0.0001642 -0.033189 0.2456131 -0.4806656 0.0007286 0.0005685 -0.0003818 -0.6300765 -0.2374438 0.000018 0.221764 -0.3568438 -0.0426565 -0.0371001 0.036944 0.0717787 -0.095669 -0.0520017 0.0100814 -0.0813247 0.0185583 -0.0428195 0.0368135 -0.0364984 -0.0720012 -0.0957607 -0.0516763 -0.0095813 -0.0814977 0.0188668 0.7247163 0.2175321 0.1602124 -0.0594838 0.1246445 0.0904439 0.1730552 0.1046943 0.2636916 0.7233305 -0.2158 -0.1628587 0.0612707 0.1243032 0.0897876 -0.1757958 0.1055305 0.2654502 -0.0047681 -0.0141916 0.0438302 0.001165 0.0438322 -0.0296656 0.046236 -0.0483284 -0.0222825 0.0173447 -0.0328594 -0.0072525 -0.0021444 -0.0386715 0.0818809 -0.0392462 0.0505938 0.0381604 0.0175211 0.033258 0.0071793 0.0026976 -0.0385612 0.0818955 0.0392559 0.0505074 0.037867 -0.0052913 0.0138202 -0.0438621 -0.0014434 0.0438337 -0.0297637 -0.0462465 -0.0485166 -0.0217902 0.0738216 -0.0888583 -0.0227961 0.0043763 0.0104736 0.0327676 -0.0430461 0.0183036 0.0519789 -0.0031446 -0.037106 -0.0168832 -0.0167724 0.0731384 -0.0512762 0.0303466 -0.0709096 -0.0767812 -0.003339 0.0365634 0.0165828 0.0163241 0.0732255 -0.0513587 -0.0305977 -0.0711994 -0.0766671 0.0739551 0.0890877 0.0225969 -0.0040508 0.0106654 0.0328535 0.0428848 0.0179205 0.0516109 unknown
polarizability: 137.327158|0.0679955|78.038237|-0.2122908|5.2995614|60.5045186 unknown
InChI: InChI=1S/C4H8Cl2OS/c5-1-3-8(7)4-2-6/h1-4H2
charge 0 multiplicity 1
16 atoms
Cl 4.106397 0.684878 0.722652
Cl -4.1032 0.676649 0.744683
S  -0.00146 -0.48056 -0.868871
O  0.002616 -1.836214 0.118887
C  1.465177 0.616197 -0.131578
C  -1.466525 0.61336 -0.123836
C  2.706443 -0.255667 -0.14028
C  -2.705929 -0.261149 -0.125624
H  1.154381 0.876285 0.892433
H  1.540777 1.508888 -0.772662
H  -1.547422 1.505683 -0.764781
H  -1.150722 0.874392 0.898398
H  2.554209 -1.180017 0.436222
H  3.081932 -0.475893 -1.150076
H  -3.086433 -0.482389 -1.133316
H  -2.548642 -1.185042 0.45025
