program: Gaussian 09
title: 000232719
version: EM64L-G09RevD.01
frameworkgroup: C1[X(C18H22N2S2)]
method: RPBEPBE
basis: SDD
operation: Freq
keyword: #p
keyword: freq=noraman
keyword: PBEPBE/SDD
title: #p freq=noraman PBEPBE/SDD
converged: YES YES NO NO
title: Mulliken charges:
elementType: S S N N C C C C C C C C C C C C C C C C C C H H H H H H H H H H H H H H H H H H H H H H
charge: 0.186550 0.186460 -0.062619 -0.062803 -0.348201 -0.370938 -0.348178 -0.370696 -0.660203 -0.660002 -0.175107 -0.174997 -0.191488 -0.191561 -0.278739 -0.278819 -0.231685 -0.231660 -0.210404 -0.210396 -0.240886 -0.240841 0.198433 0.232229 0.212673 0.202018 0.198475 0.232306 0.212642 0.201911 0.251464 0.269770 0.251339 0.269747 0.287392 0.287485 0.249115 0.249133 0.224529 0.224534 0.227862 0.227867 0.228146 0.228143
chargesum: 0.00000
title: Mulliken charges with hydrogens summed into heavy atoms:
elementType: S S N N C C C C C C C C C C C C C C C C C C
charge: 0.186550 0.186460 -0.062619 -0.062803 0.082461 0.043754 0.082604 0.043856 -0.138969 -0.138916 -0.175107 -0.174997 0.095904 0.095924 -0.029625 -0.029686 -0.007156 -0.007126 0.017459 0.017471 -0.012740 -0.012697
polarizability: 3.53326253e+02 -2.63173106e+01 2.10956250e+02 5.05836604e-02 9.64379595e-03 1.71280375e+02
1716.lowfreq: -12.9445 -0.0020 -0.0006 0.0004 1.8830 4.7616 14.7706 18.7149 20.4788
frequency: 14.2977 18.3202 20.3548 26.4174 32.8394 47.6702 81.7692 83.3379 124.6449 131.0082 188.4911 190.3090 206.9375 213.4924 253.8692 264.2787 277.4350 334.0532 334.7637 382.0179 382.1832 391.3539 397.5143 405.3480 405.4593 447.3225 473.0766 481.9862 483.6043 589.5965 611.4194 611.4722 656.9645 671.5116 675.4261 687.1187 698.5075 698.6312 745.1464 749.7794 751.0855 771.0054 847.1744 853.5767 853.6835 886.1612 915.7872 923.9306 928.0033 980.3148 980.6497 981.8106 983.8451 986.8094 993.7520 997.6065 997.7155 1016.7618 1017.9717 1018.2006 1053.0688 1070.3291 1070.9233 1073.2489 1073.5160 1083.1878 1125.7564 1136.9850 1146.9812 1153.7222 1170.7552 1170.7677 1184.3822 1184.4363 1195.2974 1208.1955 1259.5159 1272.9605 1286.9228 1291.0050 1298.9432 1308.0307 1308.6897 1311.8139 1338.0094 1356.1956 1373.0143 1373.0227 1376.3570 1378.2634 1427.0977 1427.2479 1437.2793 1438.8327 1454.3923 1456.9790 1459.1426 1460.3113 1462.8435 1467.1008 1582.7172 1582.7430 1590.3330 1590.3493 2865.1318 2873.6393 2879.0806 2888.2748 2917.9298 2918.4134 3030.7534 3033.2901 3043.3946 3045.5605 3077.2658 3077.5186 3121.2572 3121.2695 3129.9746 3129.9873 3140.6136 3140.6578 3149.1582 3149.1643 3163.6810 3163.7546
redmass: 5.1489 5.0400 4.2428 4.8448 4.9756 3.0128 8.5401 5.2416 4.4987 3.7800 4.6072 4.3683 4.7165 4.1582 2.0743 3.6873 2.0150 4.6998 2.1887 7.0638 2.7034 3.9015 6.7568 3.0152 3.0632 5.4733 2.9009 3.2903 3.5509 2.1934 6.4414 6.4178 5.8662 5.7396 6.7979 4.7222 2.3834 2.3967 3.4250 1.4596 1.6130 2.9068 1.5354 1.2474 1.2480 1.7951 1.4884 1.3748 1.4753 1.4469 1.3623 2.7050 6.0367 2.4211 2.4740 1.3111 1.3192 2.6824 3.3161 3.0560 1.7117 2.1877 2.0622 1.6887 1.8185 2.2161 1.9576 2.9917 2.6595 2.2324 1.0530 1.0531 1.1230 1.1239 1.0600 1.1358 1.3948 1.1884 1.3961 1.5643 1.4089 1.2988 1.3203 1.3463 1.2611 1.4043 8.1652 8.2265 1.3764 1.5340 2.1160 2.1335 1.1033 1.1158 1.1289 1.2144 1.3237 1.7893 1.3328 1.1380 6.2753 6.2755 5.8833 5.8841 1.0706 1.0701 1.0690 1.0686 1.0679 1.0677 1.0921 1.0878 1.0918 1.0882 1.0943 1.0942 1.0850 1.0850 1.0879 1.0879 1.0933 1.0933 1.0963 1.0963 1.1015 1.1015
irintensity: 0.0441 0.1981 0.0057 0.0799 0.3102 0.1633 1.5070 5.1840 0.0717 5.3914 2.1781 2.0460 0.0038 1.9551 0.1119 5.4349 0.1427 0.3049 9.2619 9.6238 0.0167 1.0069 0.8814 1.0140 0.5739 0.9038 1.9018 8.7234 13.5116 2.4129 0.0057 2.0000 3.1947 3.5937 1.3001 107.5139 35.7439 24.3329 13.0029 53.2881 90.7405 6.3584 1.2215 0.2627 0.1872 6.8631 1.3054 1.9205 3.7971 0.0078 0.2612 0.5725 3.8265 1.1471 200.1663 0.7468 10.4902 0.3297 37.5404 6.1353 0.0538 0.0116 26.0852 0.9516 11.4336 2.9265 174.4837 19.9662 5.1210 73.3591 0.0478 0.0206 5.0906 0.6527 1.5753 0.0450 25.6622 4.1667 102.5036 3.2873 54.6314 0.0128 14.6916 0.0155 0.8042 0.0046 0.3592 0.2275 7.2200 1.4544 1.2907 12.5268 3.8644 8.2973 15.0714 15.5083 32.3742 4.4331 77.8873 0.4343 2.3855 0.0354 37.4896 26.2217 68.6188 7.7436 43.1310 239.7467 34.1674 150.3002 42.5748 43.3038 23.0046 12.9476 7.8273 15.3527 1.2341 3.5479 19.6199 1.9885 0.4421 0.4351 17.3389 38.0376 67.7421 5.6906
temp: 298.150 k
press: 1.00000 atm
elementType: 16 16 7 7 6 6 6 6 6 6 6 6 6 6 6 6 6 6 6 6 6 6 1 1 1 1 1 1 1 1 1 1 1 1 1 1 1 1 1 1 1 1 1 1
symmnumber: 1
zpe: 943297.4 jmol-1
zpe.correction: 0.359283 hartree
zpe.thermalcorrener: 0.380563 hartree
zpe.thermalcorrenthalpy: 0.381507 hartree
zpe.thermalcorrgfe: 0.304340 hartree
zpe.sumelectzpe: -1603.077635 hartree
zpe.sumelectthermal: -1603.056355 hartree
zpe.sumelectthermalent: -1603.055411 hartree
zpe.sumelectthermalfe: -1603.132578 hartree
dipole: -0.0013 -0.0028 -2.9287
dipole: 2.9287
quadrupole: -144.4435 -141.4114 -147.8914
quadrupole: -5.2803 0.0023 0.0056
quadrupole: 0.1386 3.1707 -3.3093 -5.2803 0.0023 0.0056
hfenergy: -1603.4369182 hartree
pointgroup: C01 [X(C18H22N2S2)]
dipole: -0.0007193 -0.0049957 -1.1522208 debye
polarizability: 354.8220606|-21.8494899|209.4601316|0.083103|-0.1123091|171.2806853 unknown
InChI: InChI=1S/C18H22N2S2/c1-3-7-17(8-4-1)21-15-19-11-13-20(14-12-19)16-22-18-9-5-2-6-10-18/h1-10H,11-16H2
charge 0 multiplicity 1
44 atoms
S  3.624386 1.679044 1.251683
S  -3.624673 -1.668577 1.266369
N  1.213779 0.766921 0.057189
N  -1.214355 -0.766326 0.063662
C  0.393685 0.665277 1.286754
C  0.390325 0.656645 -1.171962
C  -0.396434 -0.65086 1.293536
C  -0.388016 -0.671075 -1.164821
C  2.149411 1.886602 0.052378
C  -2.149688 -1.886444 0.069332
C  4.695083 0.49732 0.3262
C  -4.695046 -0.493868 0.331487
C  4.16148 -0.623076 -0.356546
C  -4.161216 0.621839 -0.358722
C  6.0942 0.717459 0.353711
C  -6.094123 -0.714115 0.359754
C  5.034818 -1.508374 -1.029275
C  -5.034381 1.502441 -1.037809
C  6.959771 -0.187925 -0.301753
C  -6.959521 0.18669 -0.302227
C  6.433816 -1.29964 -1.000899
C  -6.433375 1.293753 -1.008572
H  -0.320267 1.521856 1.367849
H  1.073424 0.696446 2.157652
H  1.05823 0.686903 -2.053316
H  -0.340559 1.49845 -1.258591
H  0.317412 -1.506413 1.385627
H  -1.077738 -0.672257 2.163495
H  -1.053762 -0.712018 -2.047361
H  0.34291 -1.514029 -1.239205
H  1.707031 2.850282 0.392784
H  2.57033 2.016146 -0.958047
H  -1.706901 -2.846803 0.418623
H  -2.57033 -2.025433 -0.939964
H  3.078701 -0.788065 -0.344129
H  -3.078395 0.786678 -0.347368
H  6.498775 1.592404 0.874029
H  -6.498792 -1.585566 0.885827
H  4.620438 -2.372539 -1.561639
H  -4.619879 2.362983 -1.575916
H  8.04166 -0.015574 -0.274698
H  -8.041398 0.014373 -0.27454
H  7.106536 -1.995611 -1.514225
H  -7.105952 1.98618 -1.526858
