program: Gaussian 09
title: 000232693
version: EM64L-G09RevD.01
frameworkgroup: C1[X(C9H8Cl2O3)]
method: RPBEPBE
basis: SDD
operation: Freq
keyword: #p
keyword: freq=noraman
keyword: PBEPBE/SDD
title: #p freq=noraman PBEPBE/SDD
converged: YES YES NO NO
title: Mulliken charges:
elementType: Cl Cl O O O C C C C C C C C C H H H H H H H H
charge: -0.049388 -0.012425 -0.233887 -0.414106 -0.196661 0.577608 0.548666 -0.529435 -0.315161 -0.339055 -0.204483 -0.798330 -0.397085 0.194368 0.242459 0.280791 0.251290 0.221329 0.247938 0.288547 0.248926 0.388094
chargesum: 0.00000
title: Mulliken charges with hydrogens summed into heavy atoms:
elementType: Cl Cl O O O C C C C C C C C C
charge: -0.049388 -0.012425 -0.233887 -0.026012 -0.196661 0.577608 0.548666 -0.286975 -0.315161 -0.339055 0.076308 -0.077772 0.140388 0.194368
polarizability: 1.64935690e+02 -7.92507480e+00 1.42400898e+02 1.20894794e+01 3.95934541e+00 7.16931863e+01
1716.lowfreq: -6.2633 -0.0017 -0.0017 -0.0006 3.3318 8.8327 22.4239 34.3448 54.2851
frequency: 22.3304 34.3151 54.2812 85.6973 104.5088 140.2399 164.6574 189.1568 218.2989 245.3844 266.2558 283.6204 352.6039 361.0530 400.7343 437.7650 447.0197 491.0737 545.8933 570.3420 608.9798 626.1651 637.6943 676.3472 704.3449 709.5672 827.9193 842.3650 864.6919 927.2141 1001.5413 1007.6214 1021.5101 1044.1528 1046.9700 1072.4542 1173.6070 1231.9675 1246.7025 1254.1445 1267.9412 1349.8048 1367.5722 1373.4331 1403.5263 1446.8883 1460.2626 1463.8079 1477.6005 1582.1248 1595.3915 1691.9735 2987.4518 2996.2747 3067.9820 3089.1036 3096.0804 3152.5798 3182.8627 3519.4515
redmass: 8.4903 7.9791 9.2284 6.2048 1.0564 5.9485 9.0888 6.4872 5.0067 3.6527 5.5171 5.9974 8.4651 9.1822 6.9644 3.4672 3.4977 1.8756 4.5355 5.4427 5.6903 1.6305 3.8826 6.9156 3.0444 6.3646 4.4812 1.5909 1.3805 4.6302 1.7220 2.5290 2.4208 1.5279 5.6582 3.1376 1.6945 1.1804 1.8533 1.4091 3.3183 2.1669 3.2149 5.3372 1.2331 1.0999 1.0469 2.1385 1.3570 9.1130 6.8310 9.0903 1.0369 1.0648 1.0974 1.0964 1.0999 1.0906 1.0931 1.0644
irintensity: 0.2984 0.5344 0.4982 1.8602 0.3176 0.0702 1.2177 2.1396 1.1273 0.1533 0.0487 2.3430 2.6019 2.3223 9.3369 13.8438 17.6324 32.3343 25.1054 3.1833 1.3696 107.7910 28.2139 76.8780 1.8411 3.2262 9.6072 11.6318 27.0448 15.3690 15.0986 179.1914 218.7519 12.0262 112.0582 1.1680 57.1909 5.1192 97.7970 2.6296 11.9345 19.2889 30.0716 35.4189 20.1275 48.8505 13.3968 77.4263 125.4153 3.1559 11.4283 199.3429 18.8963 24.9191 11.7970 5.1688 16.6078 12.6042 0.6728 34.1662
temp: 298.150 k
press: 1.00000 atm
elementType: 17 17 8 8 8 6 6 6 6 6 6 6 6 6 1 1 1 1 1 1 1 1
symmnumber: 1
zpe: 397837.9 jmol-1
zpe.correction: 0.151528 hartree
zpe.thermalcorrener: 0.165749 hartree
zpe.thermalcorrenthalpy: 0.166693 hartree
zpe.thermalcorrgfe: 0.107909 hartree
zpe.sumelectzpe: -1492.507103 hartree
zpe.sumelectthermal: -1492.492883 hartree
zpe.sumelectthermalent: -1492.491939 hartree
zpe.sumelectthermalfe: -1492.550723 hartree
dipole: -2.7077 -3.3330 -1.7801
dipole: 4.6486
quadrupole: -85.5799 -90.7649 -98.5683
quadrupole: 7.1023 1.6535 0.0022
quadrupole: 6.0578 0.8728 -6.9306 7.1023 1.6535 0.0022
hfenergy: -1492.6586317 hartree
pointgroup: C01 [X(C9H8Cl2O3)]
dipole: 0.8548328 1.5975673 -0.2488042 debye
dipolederiv: -0.8108591 0.0519777 0.1219178 0.0325062 -0.1334149 -0.0180491 0.1286121 -0.0203459 -0.085317 -0.1718767 0.1998931 0.0581174 0.2538031 -0.6353063 -0.1518077 0.0725961 -0.1453124 -0.0726065 -1.7072113 -0.2792943 0.0715236 -0.1772725 -0.270177 -0.0228218 0.211864 0.0380573 -0.2895573 -0.9816095 -0.4451166 0.0665785 -0.5834543 -0.8823632 0.0685587 -0.0804335 -0.0142527 -0.257735 -0.5780727 -0.2277554 0.0023649 -0.2447701 -0.4659596 0.0397929 0.1197986 0.2305038 -0.800696 -0.114661 -0.0372891 0.0160772 -0.1440413 0.2785949 0.0592026 -0.0146075 0.0514071 0.0452411 1.4872371 0.2347695 -0.0782631 -0.1005635 -0.1955781 -0.0618121 -0.188959 -0.0904468 0.1659934 -0.222349 -0.0437657 -0.0014063 0.2184779 -0.0726653 0.020142 0.0588885 0.0539741 -0.191324 1.0786917 -0.0771103 -0.2069132 0.0307178 -0.0634414 0.0131224 -0.1928272 0.0244527 -0.0956246 -0.036112 -0.2979784 -0.0875769 -0.4595406 0.9196433 0.2598315 -0.0934709 0.2309246 -0.0608135 -0.2069503 0.0433083 0.0408171 0.0494111 -0.167425 -0.0391893 0.0357853 -0.0320379 -0.045452 -0.0062725 0.1537724 0.0376171 0.1112365 -0.0508071 -0.0396068 0.034531 -0.0484297 0.0366422 0.7513198 0.1773957 0.0596739 0.4922961 0.4066303 -0.0501598 -0.0691298 -0.0814684 -0.0072305 1.0203903 0.7230029 -0.0546245 0.7911044 0.8964894 -0.0608672 0.0263569 -0.1505335 1.032998 0.0119001 -0.0739026 0.0132313 -0.1131304 -0.0325033 -0.027725 0.0060647 -0.0257475 0.1447506 0.0736699 -0.0450988 0.0053726 -0.0398678 0.0446651 -0.0151297 0.0069936 -0.0133399 0.1621217 0.0737394 0.0220702 0.0856567 0.0119438 0.0389879 0.0179414 0.0818288 -0.0402142 -0.0586547 -0.034591 -0.1680298 -0.0032523 -0.0650239 -0.024848 -0.0118471 0.0138005 0.00594 0.1049242 0.0058582 0.0725098 -0.0949148 0.0422794 0.0265515 -0.0053825 -0.0961777 0.0455035 0.0167513 -0.0582964 -0.0139754 0.0370773 0.0070387 0.0907262 -0.0423386 0.0240832 -0.0209699 0.1003694 0.048661 0.0495094 -0.0850289 -0.0888566 -0.0689301 0.0735042 -0.0498071 0.0292115 0.0560145 0.3773941 -0.0188926 -0.0040454 -0.0242942 0.3611306 -0.0053591 -0.0357907 -0.0268759 0.0992046 unknown
polarizability: 166.1384425|-0.3072094|137.5820262|-14.2799779|15.1768936|75.3093056 unknown
InChI: InChI=1S/C9H8Cl2O3/c1-5-2-8(14-4-9(12)13)7(11)3-6(5)10/h2-3,12H,4H2,1H3
charge 0 multiplicity 1
22 atoms
Cl -4.449692 -0.06113 0.410142
Cl -0.079823 -3.220152 -0.867446
O  1.448913 -0.69622 -0.689108
O  3.725244 1.934413 0.512283
O  2.391394 0.488342 1.766553
C  -1.847832 0.965492 0.163444
C  0.095545 -0.462679 -0.4061
C  -0.462975 0.798524 -0.092305
C  -2.65581 -0.192152 0.090884
C  -0.75943 -1.591415 -0.464964
C  -2.135374 -1.463791 -0.215931
C  -2.414492 2.326899 0.506742
C  2.36276 0.427156 -0.728388
C  2.780808 0.908767 0.664074
H  0.17748 1.682672 -0.018817
H  -2.786127 -2.340099 -0.262775
H  -2.891373 2.3188 1.503768
H  -1.625633 3.097239 0.507233
H  -3.195312 2.628169 -0.215152
H  3.260606 0.053636 -1.247861
H  1.963606 1.280763 -1.310911
H  4.035515 2.244164 1.405934
