program: Gaussian 09
title: 000232696
version: EM64L-G09RevD.01
frameworkgroup: C1[X(C11H9N3O6)]
method: RPBEPBE
basis: SDD
operation: Freq
keyword: #p
keyword: freq=noraman
keyword: PBEPBE/SDD
title: #p freq=noraman PBEPBE/SDD
converged: YES YES NO NO
title: Mulliken charges:
elementType: O O O O O O N N N C C C C C C C C C C C H H H H H H H H H
charge: -0.301541 -0.187806 -0.200555 -0.179209 -0.199631 -0.225273 0.010136 0.018915 -0.348918 0.124344 0.303014 -0.526479 0.288380 0.055232 -0.377775 -0.212485 0.400128 -0.630668 0.286204 -0.599107 0.275636 0.278821 0.273616 0.248322 0.332853 0.341427 0.234042 0.245718 0.272659
chargesum: 0.00000
title: Mulliken charges with hydrogens summed into heavy atoms:
elementType: O O O O O O N N N C C C C C C C C C C C
charge: -0.301541 -0.187806 -0.200555 -0.179209 -0.199631 -0.225273 0.010136 0.018915 -0.007492 0.124344 0.303014 0.027978 0.288380 0.055232 -0.104158 0.035837 0.400128 -0.297815 0.286204 0.153313
polarizability: 2.56857251e+02 -6.88266396e+00 1.97372607e+02 -1.38873042e+01 -7.51294483e+00 8.38367697e+01
1716.lowfreq: -6.7715 -2.4775 0.0004 0.0006 0.0006 5.7806 35.8287 45.4856 49.2379
frequency: 35.8253 45.4820 49.2367 55.2339 71.3826 83.0075 123.3869 137.9234 160.2640 169.2169 177.7039 205.5712 232.1451 243.8406 279.1931 318.1724 328.1743 345.4855 381.7884 408.8517 414.2002 452.5980 519.7092 539.3221 583.9828 595.4091 628.5438 652.2936 664.4590 683.5389 692.2484 718.6879 719.1035 732.9830 745.5245 793.7190 812.6905 828.4698 858.9841 921.1704 952.2676 957.6991 959.7780 974.5568 1010.4128 1035.7680 1107.3538 1108.3959 1125.4991 1149.8526 1163.1831 1170.7838 1197.2638 1204.7556 1226.9237 1233.8336 1268.6844 1330.1206 1351.8572 1369.5015 1388.5708 1412.9163 1434.5356 1434.9090 1447.7418 1462.1136 1480.4659 1514.1796 1558.7007 1584.8687 1611.0130 1753.6936 2992.1650 3002.8932 3039.4821 3076.1252 3122.9691 3185.4369 3188.8525 3217.5974 3572.9071
redmass: 7.2201 5.2344 3.2135 11.0323 3.2369 1.6807 7.4015 6.9424 7.3034 4.6823 3.2079 5.6309 6.0611 5.3774 5.7579 9.0887 9.2207 6.2316 5.5738 3.7682 3.9130 7.7840 7.1066 4.4112 6.4770 1.1757 7.8839 9.4401 7.2640 6.1801 6.5788 3.4447 5.2202 2.5748 7.0150 4.4043 5.7792 5.2722 8.1334 2.1530 1.4643 2.1736 1.3507 4.4331 3.5636 4.5675 1.3205 1.1544 1.2908 1.7767 1.6072 2.7533 4.2697 10.2876 2.2907 5.6076 3.2630 2.3170 5.3541 8.1175 1.8220 2.6384 1.2352 3.9158 4.5378 1.4960 1.0490 1.4309 6.2167 8.6500 9.8398 10.2793 1.0350 1.0635 1.0954 1.1030 1.0995 1.0894 1.0913 1.1059 1.0774
irintensity: 0.3071 1.3983 4.5943 0.2821 0.8374 1.6396 1.5410 7.1073 3.3535 0.3546 1.0030 1.1938 3.3135 5.5373 1.1865 16.0806 3.9045 7.6145 4.2128 5.0944 11.6260 4.0971 0.4989 3.6185 16.6009 104.6089 4.9600 11.1872 44.1767 8.3733 4.1495 34.2970 13.9031 39.5299 12.2787 14.0404 64.6989 91.7136 30.9274 5.6285 17.3642 12.2652 6.0928 7.7186 11.3493 467.2350 40.8321 2.2779 1.1513 132.9335 23.5568 179.6450 211.8581 323.4366 13.2939 92.1285 83.7943 58.7101 61.1538 28.0257 111.9749 35.5218 18.9482 145.6751 73.5689 51.3263 17.4758 171.5429 19.3064 33.1290 42.3052 288.7432 63.8169 0.9124 0.4758 25.3059 4.2278 0.6476 27.7439 7.9300 61.1735
temp: 298.150 k
press: 1.00000 atm
elementType: 8 8 8 8 8 8 7 7 7 6 6 6 6 6 6 6 6 6 6 6 1 1 1 1 1 1 1 1 1
symmnumber: 1
zpe: 519120.4 jmol-1
zpe.correction: 0.197723 hartree
zpe.thermalcorrener: 0.215671 hartree
zpe.thermalcorrenthalpy: 0.216615 hartree
zpe.thermalcorrgfe: 0.150267 hartree
zpe.sumelectzpe: -1038.561789 hartree
zpe.sumelectthermal: -1038.543840 hartree
zpe.sumelectthermalent: -1038.542896 hartree
zpe.sumelectthermalfe: -1038.609244 hartree
dipole: 3.6280 6.9469 -1.9851
dipole: 8.0847
quadrupole: -106.9566 -116.0200 -116.2603
quadrupole: -0.9364 -1.6517 -0.4874
quadrupole: 6.1224 -2.9410 -3.1814 -0.9364 -1.6517 -0.4874
hfenergy: -1038.7595111 hartree
pointgroup: C01 [X(C11H9N3O6)]
dipole: -1.5900182 -2.5640296 -1.0074548 debye
polarizability: 256.7903461|-10.4415443|195.3680313|7.1634183|19.2702459|85.9082503 unknown
InChI: InChI=1S/C11H9N3O6/c1-12-11(15)20-10-7-4-2-3-6(7)8(13(16)17)5-9(10)14(18)19/h2,4-5,12H,3H2,1H3
charge 0 multiplicity 1
29 atoms
O  -1.908401 -0.85314 -0.421712
O  3.785351 1.9964 0.464887
O  4.452119 -0.167546 0.192598
O  -0.807974 3.228861 0.391901
O  -2.335725 1.886427 -0.630331
O  -2.671435 0.009975 1.667774
N  3.539488 0.748152 0.255616
N  -1.182985 2.092368 -0.08144
N  -4.148273 -0.67532 -0.042936
C  1.794812 -1.020235 -0.160802
C  0.420595 -1.366761 -0.311132
C  2.620014 -2.286057 -0.266252
C  2.132966 0.328587 0.07335
C  -0.606053 -0.3939 -0.248969
C  0.312388 -2.81869 -0.509985
C  1.571812 -3.360641 -0.490506
C  -0.217356 0.968027 -0.043902
C  1.13479 1.320787 0.13336
C  -2.942994 -0.421411 0.532211
C  -5.413579 -0.392506 0.645511
H  3.364051 -2.225803 -1.08423
H  3.223983 -2.455466 0.646305
H  -0.632399 -3.344848 -0.648432
H  1.821497 -4.416948 -0.613755
H  1.404215 2.365965 0.304551
H  -4.148997 -0.961973 -1.022481
H  -6.055838 -1.290529 0.668583
H  -5.956425 0.432176 0.149675
H  -5.185744 -0.08955 1.679042
