program: Gaussian 09
title: 000232689
version: EM64L-G09RevD.01
frameworkgroup: C1[X(C8H5Cl7)]
method: RPBEPBE
basis: SDD
operation: Freq
keyword: #pfreq=noraman
keyword: PBEPBE/SDD
title: #p freq=noraman PBEPBE/SDD
converged: NO NO NO NO
title: Mulliken charges:
elementType: Cl Cl Cl Cl Cl Cl Cl C C C C C C C C H H H H H
charge: 0.067431 0.088888 0.135654 0.097693 0.005547 0.068853 0.078280 -0.175373 -0.111328 0.015672 -0.493042 -0.467939 0.010565 0.012423 -0.731755 0.303485 0.364284 0.237795 0.250029 0.242837
chargesum: 0.00000
title: Mulliken charges with hydrogens summed into heavy atoms:
elementType: Cl Cl Cl Cl Cl Cl Cl C C C C C C C C
charge: 0.067431 0.088888 0.135654 0.097693 0.005547 0.068853 0.078280 -0.175373 -0.111328 0.319157 -0.493042 -0.103655 0.010565 0.012423 -0.001094
polarizability: 1.59467078e+02 4.14875253e+00 1.45030242e+02 -6.47240157e+00 3.27112358e+00 1.30386591e+02
1716.lowfreq: -7.6540 -0.0029 -0.0026 -0.0018 5.4094 12.3669 68.2726 84.2730 97.5792
frequency: 68.2436 84.2656 97.5769 118.3705 129.6546 145.1074 149.1541 152.9003 155.2780 176.0044 192.3411 221.1700 238.3302 243.8262 286.3822 310.5675 326.4689 347.1668 353.6395 373.9986 461.8008 506.2426 546.5733 585.5965 639.7345 653.2498 694.5552 736.7787 810.7184 848.9800 853.1918 877.1429 933.2640 996.5253 1018.4993 1044.8663 1062.2639 1088.5917 1094.1952 1138.9607 1155.8828 1236.2194 1247.8624 1276.3254 1321.5775 1399.0087 1467.4744 1475.4579 1604.0119 3004.5093 3034.2210 3101.9838 3106.2000 3113.8804
redmass: 13.1750 22.0508 17.9801 17.8984 10.3163 20.5512 31.4600 19.9588 21.8919 19.5349 9.6809 1.2312 10.9373 2.6214 13.2517 18.8323 13.7644 26.5957 7.5071 9.4042 4.7490 8.1428 6.5015 10.3351 9.8575 7.6493 6.5644 5.4827 7.5253 9.1336 6.6905 3.4974 3.5086 9.4796 3.3424 7.3599 2.2486 2.5045 2.6868 3.4616 7.1731 1.2129 1.5080 1.3886 1.3251 1.1953 1.0448 1.0451 12.0024 1.0360 1.0845 1.0995 1.0883 1.1001
irintensity: 0.4611 0.0809 0.3913 0.2411 0.2367 0.1204 0.0911 0.1049 0.1390 0.2379 0.7532 0.4875 0.4816 0.7177 0.1663 0.3465 0.9850 0.5614 2.4049 4.7910 3.0993 24.8586 18.9589 4.0396 41.3912 53.4334 46.9376 29.5919 46.9939 9.9553 4.4330 6.2562 48.7026 13.5546 46.6363 18.4277 5.1323 8.7040 6.0211 1.5630 40.8633 7.8088 18.2758 11.8379 3.2633 17.8324 12.1293 11.4202 55.9627 11.7216 2.1413 8.7783 0.6470 14.5053
temp: 298.150 k
press: 1.00000 atm
elementType: 17 17 17 17 17 17 17 6 6 6 6 6 6 6 6 1 1 1 1 1
symmnumber: 1
zpe: 288938.8 jmol-1
zpe.correction: 0.110051 hartree
zpe.thermalcorrener: 0.126050 hartree
zpe.thermalcorrenthalpy: 0.126995 hartree
zpe.thermalcorrgfe: 0.066011 hartree
zpe.sumelectzpe: -3527.103456 hartree
zpe.sumelectthermal: -3527.087457 hartree
zpe.sumelectthermalent: -3527.086512 hartree
zpe.sumelectthermalfe: -3527.147496 hartree
dipole: -0.5215 -0.6177 2.1354
dipole: 2.2833
quadrupole: -141.2571 -135.5646 -130.7112
quadrupole: 1.1197 -3.0608 1.4910
quadrupole: -5.4128 0.2797 5.1331 1.1197 -3.0608 1.4910
hfenergy: -3527.213507 hartree
pointgroup: C01 [X(C8H5Cl7)]
dipole: 0.3323348 -0.4645932 -0.6932949 debye
dipolederiv: -0.6105836 -0.0486907 -0.000686 -0.0615722 -0.1005776 -0.0087716 -0.0099991 -0.0203461 -0.1112054 -0.4259537 0.2235028 0.0222375 0.2406808 -0.227438 -0.0208781 0.0143958 -0.0231391 -0.0977784 -0.0802624 -0.0671339 -0.0609598 -0.0611233 -0.3093901 -0.2043786 -0.0714309 -0.2549171 -0.4651064 -0.0878573 -0.0683262 0.0515947 -0.0611093 -0.3742975 0.2790184 0.0390457 0.2450763 -0.5573848 -0.3360504 -0.1908008 -0.0924802 -0.2153559 -0.3539153 -0.1213201 -0.0350349 -0.0585905 -0.158877 -0.193942 0.1925217 -0.1385983 0.2702273 -0.2733144 0.2676407 -0.2168301 0.2764778 -0.2225014 -0.344169 -0.1112482 0.2638796 -0.1888546 -0.0552335 0.1925582 0.3235773 0.1527594 -0.2599301 0.8368354 0.0650526 -0.0879123 0.1811694 0.0227274 0.0219147 0.0493196 0.0753815 0.0243607 0.5318745 -0.3947306 0.0382198 -0.4893192 0.2605139 -0.0051813 0.0196129 0.1193924 0.0078922 -0.1516156 -0.0133751 0.0177471 -0.0381465 -0.0442617 -0.0093543 0.0856103 0.0406498 0.0845671 0.0233594 0.2029115 0.0144228 0.1774827 0.7767737 -0.1226529 0.0187076 -0.0780398 1.1555681 0.2833823 0.3687944 0.114919 0.3858945 0.3611129 0.1506077 -0.0413382 0.0696291 0.1101047 0.0658676 -0.3824584 0.3303007 -0.4116191 0.2734292 -0.32733 0.2801264 -0.3730026 0.1919133 0.3855203 0.2904716 -0.4528674 0.3380462 -0.1007819 -0.1427591 -0.4279045 -0.2172594 0.2649387 0.0186351 0.0221618 -0.0207922 0.0051062 -0.0479604 -0.0021686 -0.015673 -0.0779314 0.0057662 0.0297779 -0.019546 0.0076462 -0.0248663 0.0264269 0.0514684 0.0450058 0.047057 -0.0268647 0.0100538 -0.0405325 -0.0142233 -0.0323919 0.0078936 0.0142743 -0.0433341 0.0398525 0.0164309 -0.1011339 0.0508346 0.0197885 0.0085957 0.0854218 0.0026242 -0.0221792 0.0217197 0.112965 0.0548907 -0.0450641 0.0657881 -0.0192703 0.0424232 0.0437183 0.0516665 0.0864358 -0.0103292 0.0913707 -0.0343446 -0.0780244 -0.0035741 0.0304477 -0.0590304 -0.0433439 -0.0712054 -0.0645294 unknown
polarizability: 161.3212799|-0.941221|139.0113307|-2.5041528|-8.268032|134.5513005 unknown
InChI: InChI=1S/C8H5Cl7/c1-2-3(9)7(13)5(11)4(10)6(2,12)8(7,14)15/h2-3H,1H3
charge 0 multiplicity 1
20 atoms
Cl 3.004642 0.239947 -0.092205
Cl -2.556484 1.558412 0.041098
Cl 0.605656 2.374222 1.444649
Cl 0.549154 2.465271 -1.543962
Cl -2.074007 -1.668569 -1.502308
Cl 1.444969 -1.857933 2.085115
Cl -2.006935 -1.032266 2.174088
C  1.181078 0.029244 -0.13582
C  -1.030395 0.555328 -0.079566
C  0.652546 -0.628137 -1.473171
C  0.330869 1.348967 -0.067252
C  -0.879502 -0.230763 -1.43006
C  0.561937 -0.725515 1.046671
C  -0.762994 -0.417434 1.078819
C  0.994178 -2.118471 -1.604618
H  1.113086 -0.078098 -2.313683
H  -1.165243 0.404799 -2.279499
H  2.089686 -2.250598 -1.572897
H  0.539606 -2.721828 -0.802806
H  0.624152 -2.507077 -2.568095
