program: Gaussian 09
title: 000232715
version: EM64L-G09RevD.01
frameworkgroup: C1[X(C19H24N2S)]
method: RPBEPBE
basis: SDD
operation: Freq
keyword: #p
keyword: freq=noraman
keyword: PBEPBE/SDD
title: #p freq=noraman PBEPBE/SDD
converged: YES YES NO NO
title: Mulliken charges:
elementType: S N N C C C C C C C C C C C C C C C C C C C H H H H H H H H H H H H H H H H H H H H H H H H
charge: 0.183859 -0.191148 -0.059438 -0.389457 -0.401456 -0.354304 -0.382748 0.286510 -0.660181 0.303149 -0.346540 -0.373538 -0.831003 -0.254309 -0.252729 -0.199530 -0.269250 -0.176678 0.444390 -0.375355 -0.396802 -0.806232 0.218179 0.225153 0.229916 0.190905 0.193050 0.231111 0.210992 0.203590 0.248877 0.269918 0.240553 0.226436 0.227081 0.222435 0.244986 0.221532 0.224545 0.247464 0.284871 0.230029 0.228155 0.223477 0.223731 0.235803
chargesum: 0.00000
title: Mulliken charges with hydrogens summed into heavy atoms:
elementType: S N N C C C C C C C C C C C C C C C C C C C
charge: 0.183859 -0.191148 -0.059438 0.053876 0.019366 0.069857 0.031834 0.286510 -0.141385 0.303149 -0.105987 -0.147102 -0.136501 -0.032777 -0.028184 -0.199530 -0.021785 0.108193 0.444390 -0.145326 -0.168647 -0.123221
polarizability: 3.29315005e+02 5.34948219e+00 2.53422284e+02 2.61646800e+00 9.89626671e+00 1.43688931e+02
1716.lowfreq: -14.4479 -9.1195 -0.0014 -0.0006 0.0005 1.9965 5.0201 15.4248 19.0317
frequency: -14.2265 12.0106 18.8115 26.6687 49.5239 70.3202 80.2408 106.2054 110.8206 148.7390 172.4639 189.3934 195.1702 244.8586 255.6160 265.7130 283.3417 302.7960 320.7986 334.2909 342.1434 357.7066 378.0468 404.3828 407.5369 451.4156 464.9158 479.5437 496.3047 510.6555 549.7164 554.2162 602.3859 622.4603 631.7814 674.0279 704.8211 710.8069 724.0954 755.4565 760.3166 785.3309 793.5191 820.1151 846.8636 853.9433 857.3496 901.1067 922.5508 933.1409 955.2203 972.7810 975.0933 979.8039 982.9546 986.3634 1001.2162 1006.4393 1041.7461 1046.5421 1048.4977 1051.9264 1055.0577 1073.0998 1088.4589 1115.9513 1116.2248 1132.1805 1148.6527 1163.8603 1173.8227 1190.3105 1196.0905 1201.2176 1219.4674 1227.8221 1235.7333 1271.5064 1288.2421 1295.1530 1300.0126 1301.8220 1333.9487 1341.9380 1350.9733 1358.7849 1365.4297 1377.8933 1378.7356 1389.5034 1395.6234 1397.0520 1432.6083 1438.3053 1453.2223 1456.0164 1458.7586 1466.4112 1467.0170 1470.7492 1472.5992 1481.8385 1487.3061 1491.9616 1573.4422 1581.8338 1607.0628 1609.5394 2867.2389 2875.3192 2888.2709 2908.9101 2914.5372 2963.9391 2973.3647 3027.9620 3039.1367 3043.2571 3053.5813 3054.4075 3076.9272 3081.5158 3083.5340 3092.5493 3113.9149 3116.0554 3120.1157 3126.3636 3140.8235 3146.7514 3149.9822 3161.6080
redmass: 1.0319 4.3336 3.9995 3.7546 4.9032 4.8793 3.0672 5.0823 3.7757 4.5816 4.2442 1.4186 1.6338 3.3205 4.9824 2.1638 2.5996 3.6733 2.7593 2.8231 3.0186 6.1553 2.2794 3.6184 2.9890 2.7861 3.2870 2.9157 2.7854 4.8370 3.2925 4.0667 5.4571 3.2707 6.8393 5.2455 3.2327 3.4537 2.3902 3.2219 1.6191 4.9725 4.3540 1.3518 1.5112 1.2461 1.3743 1.7715 3.6569 1.3889 1.3216 1.4550 1.6014 1.5572 1.4016 1.3609 2.6313 3.8169 1.5411 1.5584 2.2327 1.7624 2.0869 2.9844 2.2628 1.8554 1.3219 2.4823 3.0054 2.0857 1.0873 1.1248 1.1263 2.0658 2.9137 1.7110 1.4637 1.2360 1.4931 1.4015 1.4744 1.3171 1.2700 1.7862 1.4471 4.9659 2.1733 1.5516 2.1658 1.2742 1.2286 3.1621 2.0348 1.0984 1.0914 1.0948 1.1587 1.0799 1.1037 1.0912 1.0534 2.3538 1.1629 2.2444 6.1453 6.4307 6.1429 6.0519 1.0701 1.0696 1.0686 1.0717 1.0679 1.0398 1.0387 1.0910 1.0899 1.0926 1.0903 1.0948 1.0940 1.0996 1.0997 1.0888 1.0871 1.0886 1.0883 1.0878 1.0963 1.0927 1.0964 1.1002
irintensity: 0.4881 0.2335 0.1387 0.2239 0.5205 0.7921 1.7658 1.4308 0.6151 1.1133 0.1848 3.5510 2.5372 2.6895 0.9993 6.4665 2.1506 2.7626 7.1046 0.7106 0.6003 3.4639 0.1449 0.8697 0.6248 6.4756 3.0760 2.7619 23.6331 1.8378 1.4832 1.1795 3.6487 6.6189 0.8709 45.1735 2.6266 0.6421 18.1322 16.8938 57.3191 1.6690 1.6344 51.4701 0.0349 1.6110 0.7007 3.1160 22.5807 2.6288 0.7267 7.0874 5.8835 9.6347 0.0731 1.4573 149.4473 7.4895 7.8226 20.6073 8.9666 0.4492 10.0028 17.6237 1.4478 23.1449 5.6383 109.0915 47.0236 9.5556 0.4250 4.5851 20.2127 7.5696 1.0727 72.2238 19.3384 37.4032 15.4397 31.1196 17.2663 13.1903 2.7801 23.6149 0.8213 0.4658 33.3185 7.4470 6.9972 15.9296 9.1504 1.5507 22.2058 6.1821 18.9683 7.2797 14.6423 27.3018 5.3243 13.4275 12.9878 80.1315 7.2720 103.7607 0.2788 9.0323 2.5530 45.8846 76.2694 25.8373 112.8146 90.2079 134.2206 36.5114 43.8996 41.8215 19.0698 25.5674 29.4144 25.5735 12.2743 22.6359 18.2190 14.1390 13.2591 15.8703 16.3339 10.9737 12.5318 37.9560 13.8047 24.1767
temp: 298.150 k
press: 1.00000 atm
elementType: 16 7 7 6 6 6 6 6 6 6 6 6 6 6 6 6 6 6 6 6 6 6 1 1 1 1 1 1 1 1 1 1 1 1 1 1 1 1 1 1 1 1 1 1 1 1
symmnumber: 1
zpe: 1010762.7 jmol-1
zpe.correction: 0.384979 hartree
zpe.thermalcorrener: 0.405685 hartree
zpe.thermalcorrenthalpy: 0.406629 hartree
zpe.thermalcorrgfe: 0.332838 hartree
zpe.sumelectzpe: -1244.336872 hartree
zpe.sumelectthermal: -1244.316167 hartree
zpe.sumelectthermalent: -1244.315222 hartree
zpe.sumelectthermalfe: -1244.389013 hartree
dipole: 0.0117 0.7091 1.2410
dipole: 1.4293
quadrupole: -135.5518 -131.9577 -141.2777
quadrupole: 9.1371 3.8569 0.7674
quadrupole: 0.7106 4.3047 -5.0153 9.1371 3.8569 0.7674
hfenergy: -1244.7218512 hartree
pointgroup: C01 [X(C19H24N2S1)]
dipole: 0.0271141 -0.2208437 0.5164495 debye
polarizability: 328.2830432|5.1261807|249.8847717|-12.6628903|-22.5673417|148.2584043 unknown
InChI: InChI=1S/C19H24N2S/c1-16-7-9-18(10-8-16)22-15-20-11-13-21(14-12-20)19-6-4-3-5-17(19)2/h3-10H,11-15H2,1-2H3
charge 0 multiplicity 1
46 atoms
S  -2.95314 2.290789 -0.465298
N  2.242641 0.40498 0.171369
N  -0.451163 1.367983 0.510324
C  1.426847 0.817248 -1.001772
C  1.383973 -0.127675 1.249638
C  0.393488 1.877927 -0.593185
C  0.359009 0.93917 1.677788
C  3.490293 -0.25522 -0.085304
C  -1.571621 2.238416 0.854496
C  4.562917 0.460369 -0.715598
C  3.704063 -1.60136 0.326922
C  5.785546 -0.217261 -0.941279
C  4.441119 1.930647 -1.07548
C  4.938026 -2.247409 0.103912
C  5.985392 -1.559431 -0.54639
C  -3.826297 0.698489 -0.147959
C  -5.24153 0.698359 -0.173956
C  -3.127338 -0.511646 0.076574
C  -5.268743 -1.731435 0.257246
C  -5.948909 -0.509043 0.01878
C  -3.850238 -1.706067 0.292014
C  -6.035715 -3.029978 0.440939
H  0.890677 -0.063942 -1.425987
H  2.08243 1.221139 -1.78815
H  2.016273 -0.392809 2.115273
H  0.826823 -1.040967 0.927346
H  0.926935 2.81532 -0.295104
H  -0.266162 2.108639 -1.449867
H  -0.317261 0.511159 2.441595
H  0.90849 1.796896 2.137511
H  -1.297929 3.313946 0.952144
H  -2.034564 1.893747 1.79348
H  2.892459 -2.155512 0.809514
H  6.608313 0.334449 -1.413607
H  5.427608 2.424115 -1.027586
H  4.053027 2.087518 -2.101719
H  3.752952 2.442817 -0.379036
H  5.074279 -3.285814 0.427288
H  6.946974 -2.051286 -0.728852
H  -5.78414 1.636907 -0.330963
H  -2.031929 -0.501136 0.080997
H  -7.045667 -0.496453 -0.004201
H  -3.300142 -2.638011 0.474237
H  -5.483922 -3.740446 1.081597
H  -7.025386 -2.854718 0.89881
H  -6.208754 -3.531408 -0.531499
