program: Gaussian 09
title: 000232678
version: EM64L-G09RevD.01
frameworkgroup: C1[X(C8H6ClN3O6)]
method: RPBEPBE
basis: SDD
operation: Freq
keyword: #p
keyword: freq=noraman
keyword: PBEPBE/SDD
title: #p freq=noraman PBEPBE/SDD
converged: YES YES NO NO
title: Mulliken charges:
elementType: Cl O O O O O O N N N C C C C C C C C H H H H H H
charge: 0.028377 -0.294430 -0.171456 -0.190312 -0.184419 -0.191086 -0.221524 0.026382 0.019958 -0.346475 0.390510 0.405235 0.469829 -0.534250 -0.262558 -0.402888 0.292674 -0.597867 0.337545 0.319702 0.347947 0.239227 0.246842 0.273036
chargesum: 0.00000
title: Mulliken charges with hydrogens summed into heavy atoms:
elementType: Cl O O O O O O N N N C C C C C C C C
charge: 0.028377 -0.294430 -0.171456 -0.190312 -0.184419 -0.191086 -0.221524 0.026382 0.019958 0.001472 0.390510 0.405235 0.469829 -0.196705 -0.262558 -0.083186 0.292674 0.161239
polarizability: 2.28666766e+02 6.39882278e+00 1.65848576e+02 -1.36911176e+01 -5.38976894e+00 7.14075694e+01
1716.lowfreq: -9.0314 -3.7293 -0.0010 -0.0007 0.0014 2.3755 35.4846 48.0420 50.9659
frequency: 35.4732 48.0357 50.9598 56.4560 77.9520 100.5269 122.7798 136.0765 154.4627 161.8343 175.7677 201.0217 228.9667 272.5550 308.4441 326.7361 336.0742 350.1634 387.5085 455.7295 480.2964 514.1684 528.4203 581.8366 603.3836 651.4069 663.9245 676.6201 681.0361 705.7284 711.8870 760.5505 777.1442 817.4506 844.7277 895.3432 929.7724 956.4818 1025.6112 1062.4235 1125.8748 1128.2915 1152.8327 1174.7174 1179.3380 1201.2107 1218.3100 1255.0555 1362.2597 1376.1779 1391.5984 1408.3458 1436.9840 1444.3337 1464.2413 1481.3806 1516.0488 1576.9273 1597.9135 1763.6344 2995.2989 3080.5585 3125.1842 3190.3406 3191.5623 3569.8127
redmass: 7.3210 6.9506 5.6055 14.7872 6.2499 1.1891 8.1971 8.8341 12.4958 5.0841 7.6561 5.2003 5.9694 7.0630 9.7287 12.8254 9.8312 13.1831 11.6006 6.5590 6.9825 7.2398 6.0963 6.0170 1.1768 7.4310 10.6915 7.2950 10.0978 10.9954 7.0677 5.8785 7.4683 10.9005 6.3686 8.7186 1.4206 1.4751 5.1935 1.9659 1.2927 4.7307 1.8497 2.4285 1.6252 9.2650 9.6340 3.4838 5.7501 10.9376 10.8466 5.3787 1.1656 3.0123 1.4828 1.0437 1.4427 9.5032 8.2940 10.3968 1.0348 1.1032 1.0998 1.0926 1.0930 1.0776
irintensity: 0.9977 0.9906 5.4231 0.2266 1.9391 0.5281 2.4866 7.7500 2.8314 1.8996 0.4376 0.7018 2.2542 3.5738 15.1592 3.1003 5.2957 3.4490 5.8569 3.2435 13.4892 1.2234 4.9845 0.8229 98.9838 22.2425 34.9471 8.9386 18.4124 58.9573 12.0139 23.3012 27.9618 10.6065 122.1156 83.3632 14.6174 24.6631 292.2605 151.2792 0.4217 35.5339 127.1651 166.3381 21.7011 459.0069 151.5069 88.8656 43.2784 48.8220 46.2543 79.5907 32.7954 269.1684 43.4639 17.6138 132.2614 0.7814 46.4200 288.8983 55.1802 22.7852 3.8541 17.5513 20.3643 68.7472
temp: 298.150 k
press: 1.00000 atm
elementType: 17 8 8 8 8 8 8 7 7 7 6 6 6 6 6 6 6 6 1 1 1 1 1 1
symmnumber: 1
zpe: 390365.2 jmol-1
zpe.correction: 0.148682 hartree
zpe.thermalcorrener: 0.165700 hartree
zpe.thermalcorrenthalpy: 0.166644 hartree
zpe.thermalcorrgfe: 0.101938 hartree
zpe.sumelectzpe: -1382.625057 hartree
zpe.sumelectthermal: -1382.608039 hartree
zpe.sumelectthermalent: -1382.607095 hartree
zpe.sumelectthermalfe: -1382.671801 hartree
dipole: 5.4328 3.5653 -1.7025
dipole: 6.7175
quadrupole: -103.9670 -119.2160 -110.7395
quadrupole: 2.8893 -0.1383 0.0200
quadrupole: 7.3405 -7.9085 0.5680 2.8893 -0.1383 0.0200
hfenergy: -1382.7737388 hartree
pointgroup: C01 [X(C8H6Cl1N3O6)]
dipole: 2.2007022 1.1813077 -0.8637819 debye
dipolederiv: -0.1051093 -0.1974893 0.0468596 -0.191827 -0.5937148 0.1369591 0.0332792 0.1313304 -0.0449806 -2.4017281 -0.043913 -0.4060011 0.2811258 -0.2465854 0.1257395 -0.4149977 0.1114784 -0.510377 -0.4100284 0.0080238 0.1035005 -0.0541709 -0.7507296 0.1925328 0.1334049 0.1567108 -0.2992704 -0.6793549 0.0835011 0.2059992 0.113341 -0.4694436 0.0156014 0.1359425 0.0396084 -0.3387145 -0.7137024 -0.174163 0.0712281 -0.2241754 -0.6345226 0.1023536 0.0952621 0.1084809 -0.2371617 -0.8182395 0.1933784 -0.0011896 0.2116653 -0.5740992 0.0673899 0.0001953 0.0644765 -0.2301446 -0.7825917 -0.0180251 0.1047144 0.0160246 -0.3267058 0.1715247 -0.0743104 0.0915233 -0.900017 1.0076515 -0.3779129 -0.3361954 -0.2726644 1.3735792 -0.2635238 -0.2972586 -0.2587934 0.4429819 1.9854243 0.0334041 -0.1241981 0.0742627 0.9709741 -0.180445 -0.1772166 -0.1805671 0.2330984 -1.4238974 -0.0447883 0.1123443 -0.1364924 -0.4526909 0.0036633 0.1255659 -0.0302731 -0.3955006 -0.3161418 0.3015297 0.0143545 -0.0488869 -0.3529356 0.0580952 0.1944293 0.0444135 0.0401082 1.5886877 0.0905197 0.1627074 0.0732207 0.083747 0.1212941 -0.2299111 -0.0179801 0.0489632 -0.7331139 -0.0092082 0.0427689 -0.1092895 -0.0864953 0.0014323 0.086688 0.0313704 0.0609434 0.2166044 -0.190054 -0.0032526 -0.1506546 -0.0965184 0.0079881 -0.0156604 0.0566676 -0.0592684 -0.446707 0.4087865 -0.1384134 0.5359607 0.9865019 -0.2646939 -0.191093 -0.2649517 -0.0085628 0.2078664 -0.109345 0.0341458 0.2439745 -0.142716 0.0344282 -0.0678016 0.0285537 -0.0489726 2.7619352 0.0394164 0.0191539 -0.3833516 0.4254019 -0.3779867 0.4478431 -0.163172 1.423919 0.5518959 -0.0275513 0.078454 -0.0991512 0.2331632 0.0400584 0.3661063 0.0451391 0.0891222 0.1726783 -0.0063236 -0.0083368 0.0007732 0.1515055 0.005722 0.0131301 0.0018442 0.1806228 0.1492841 0.0393676 -0.0086257 -0.0029511 0.1193912 0.0094838 0.0201954 0.0133696 0.1695595 0.21905 0.0347583 -0.0277477 0.0963606 0.3327147 0.0421375 -0.1086029 0.0434375 0.2053732 -0.0999472 -0.0744191 -0.0342169 -0.1345115 -0.0511078 -0.0088296 -0.0631547 0.0110538 0.122599 -0.0552827 0.061428 0.0051815 0.1477285 -0.016971 -0.0793834 0.0004343 -0.1020904 0.058537 0.1247666 -0.0209207 0.0867649 0.0136889 0.1182572 0.0384587 -0.0124695 0.0383695 -0.0028577 unknown
polarizability: 229.7362063|2.6675986|159.4381324|-9.4871779|-23.7100434|76.7485728 unknown
InChI: InChI=1S/C8H6ClN3O6/c1-10-8(13)18-7-5(9)2-4(11(14)15)3-6(7)12(16)17/h2-3,10H,1H3
charge 0 multiplicity 1
24 atoms
Cl 0.120442 3.319555 -0.88428
O  1.731017 0.886528 -0.519396
O  0.201015 -2.939383 0.607203
O  1.829088 -1.892173 -0.593409
O  -4.271218 -1.14216 0.458697
O  -4.611364 1.067747 -0.007807
O  2.355558 0.028088 1.621103
N  0.687014 -1.911227 0.007929
N  -3.851849 0.037596 0.153946
N  3.933933 0.535802 -0.063405
C  -0.15314 -0.6845 -0.046722
C  0.391319 0.602331 -0.34586
C  -2.389682 0.227102 -0.024918
C  -1.535637 -0.87374 0.136391
C  -0.52541 1.680105 -0.504626
C  -1.906899 1.51098 -0.357836
C  2.701479 0.402077 0.48647
C  5.157783 0.18535 0.668939
H  -1.930023 -1.862157 0.384631
H  -2.604678 2.3434 -0.476484
H  3.983803 0.828937 -1.040128
H  5.840379 1.051298 0.726932
H  5.677432 -0.657705 0.180222
H  4.878538 -0.11785 1.689606
