program: Gaussian 09
title: 000232676
version: EM64L-G09RevD.01
frameworkgroup: C1[X(C19H17NO)]
method: RPBEPBE
basis: SDD
operation: Freq
keyword: #p
keyword: freq=noraman
keyword: PBEPBE/SDD
title: #p freq=noraman PBEPBE/SDD
converged: YES YES NO NO
title: Mulliken charges:
elementType: O N C C C C C C C C C C C C C C C C C C C H H H H H H H H H H H H H H H H H
charge: -0.250703 -0.174542 -0.507162 0.163099 0.206774 0.154188 -0.442050 0.439167 0.431304 -0.389925 -0.445680 -0.382868 -0.384793 -0.356247 -0.437192 -0.261306 -0.248342 0.447545 -0.377620 -0.404041 -0.809483 0.245307 0.238996 0.250711 0.250003 0.251577 0.240030 0.236581 0.229535 0.260604 0.239936 0.225153 0.226709 0.227377 0.227930 0.234063 0.222031 0.223333
chargesum: 0.00000
title: Mulliken charges with hydrogens summed into heavy atoms:
elementType: O N C C C C C C C C C C C C C C C C C C C
charge: -0.250703 -0.174542 -0.022858 0.163099 0.206774 0.154188 0.058665 0.439167 0.431304 -0.138348 -0.205650 -0.146287 -0.155258 -0.095643 -0.197256 -0.036154 -0.020412 0.447545 -0.150911 -0.176664 -0.130056
polarizability: 2.90709571e+02 -1.86359604e+01 2.25203209e+02 -1.03085445e+00 -2.07711661e+01 1.44102930e+02
1716.lowfreq: -10.3687 -6.7286 0.0006 0.0009 0.0009 3.1964 11.3353 18.4207 48.4607
frequency: -8.7500 18.2793 48.3729 56.0044 90.8379 125.0879 146.9202 186.7791 213.0957 218.3349 280.3947 305.7896 323.1773 369.1206 383.8169 400.0225 410.3683 412.1897 430.9585 478.5328 483.2716 511.2634 521.8678 537.6803 541.2950 582.5005 633.0755 643.1902 658.1073 665.7651 700.8337 716.5218 751.5498 756.5757 781.5239 804.5153 818.7275 823.5639 824.7528 830.6531 849.1083 873.4562 922.0252 937.1750 949.7651 958.6530 968.8354 978.2292 985.1802 987.2292 991.8449 1006.4332 1033.0432 1045.9934 1048.5815 1090.1240 1127.8503 1148.3848 1160.7800 1177.4853 1195.5489 1197.1798 1216.7112 1220.6315 1226.8158 1235.1251 1241.5166 1273.9874 1310.9335 1316.0344 1359.3061 1366.5837 1368.1123 1387.4760 1396.4712 1405.9521 1418.3028 1424.8664 1435.8280 1451.4453 1468.2194 1471.1556 1472.6926 1473.8087 1513.5469 1520.5393 1578.5296 1584.7331 1603.0590 1627.9533 1632.3058 2944.4452 2970.8763 3000.2397 3050.8385 3052.9057 3080.3692 3114.9463 3119.2435 3119.9546 3128.3627 3131.7796 3136.8571 3141.7816 3145.4871 3153.8527 3162.3568 3167.4170
redmass: 1.0485 4.1278 4.6236 3.8535 4.0724 4.0255 6.0774 3.7570 3.7814 3.3955 4.1503 3.1335 4.4628 2.9295 5.0815 3.5846 3.2874 3.0715 4.4336 4.6875 3.5934 3.9288 3.2863 3.4593 3.0699 6.3734 6.3001 6.1312 3.7116 5.1068 5.3180 3.0426 2.8217 1.5934 3.1758 4.3611 2.0744 2.4896 1.6502 1.3470 4.4969 1.6490 4.1514 1.3632 1.3466 1.3730 1.4720 1.7649 1.4324 1.3528 3.7636 2.7755 2.2326 1.5355 3.0741 2.1892 1.4047 1.3491 1.5678 1.1452 2.3079 1.1802 1.3061 1.6463 2.7727 1.8062 2.2333 1.7088 1.4693 1.3514 2.1313 4.0266 1.5932 2.0976 1.2313 3.5151 3.2597 3.4956 4.0890 1.6019 1.4329 1.1280 1.0626 1.0949 2.9080 3.6243 6.1858 7.8992 6.0793 6.4495 6.6657 1.0696 1.0387 1.0683 1.0950 1.0915 1.0995 1.0876 1.0887 1.0861 1.0879 1.0885 1.0997 1.0957 1.0943 1.0952 1.1004 1.0962
irintensity: 0.4632 0.1379 0.3709 0.5556 1.1611 1.3883 2.2473 0.3345 6.6984 0.2022 2.7407 1.7012 1.3436 4.8841 3.2704 8.1225 0.1876 7.5100 7.1659 4.0778 4.4744 6.1601 5.5371 1.8830 14.8059 8.5662 4.1237 5.0472 3.1714 8.2673 5.0277 1.2644 10.0790 53.3273 9.5181 7.8888 39.5756 213.8258 87.6921 15.6977 12.1995 8.0962 104.4470 14.6909 2.2455 0.2921 3.4750 2.2251 0.8621 0.1031 26.4184 6.0648 4.7609 15.5937 26.9638 22.1842 12.2625 3.8939 47.4714 4.3536 114.9682 0.2666 30.8788 170.7624 2.6133 2.5925 55.2849 7.5567 12.5521 1.5131 28.0541 0.5315 19.2584 42.5957 12.9091 16.6269 2.2847 20.2258 20.4962 12.5332 34.4195 8.3118 9.2518 12.5844 224.4433 26.1468 4.3021 10.4003 31.0622 71.1619 22.5908 41.7434 52.9132 66.2571 25.6680 9.3131 18.5131 18.8630 32.8348 3.5241 2.7644 10.7555 11.9105 19.5242 37.3032 4.5534 34.3515 9.0202
temp: 298.150 k
press: 1.00000 atm
elementType: 8 7 6 6 6 6 6 6 6 6 6 6 6 6 6 6 6 6 6 6 6 1 1 1 1 1 1 1 1 1 1 1 1 1 1 1 1 1
symmnumber: 1
zpe: 805939.6 jmol-1
zpe.correction: 0.306966 hartree
zpe.thermalcorrener: 0.323071 hartree
zpe.thermalcorrenthalpy: 0.324015 hartree
zpe.thermalcorrgfe: 0.262484 hartree
zpe.sumelectzpe: -862.737553 hartree
zpe.sumelectthermal: -862.721449 hartree
zpe.sumelectthermalent: -862.720505 hartree
zpe.sumelectthermalfe: -862.782036 hartree
dipole: -0.1237 -0.9828 0.6201
dipole: 1.1686
quadrupole: -112.9156 -115.1556 -120.8901
quadrupole: -0.4986 -0.5143 -3.6584
quadrupole: 3.4049 1.1648 -4.5697 -0.4986 -0.5143 -3.6584
hfenergy: -863.0445196 hartree
pointgroup: C01 [X(C19H17N1O1)]
dipole: -0.0537048 -0.4158154 0.1887052 debye
polarizability: 289.4920015|-19.9737457|230.2930434|-7.7695036|-8.0630255|140.2306649 unknown
InChI: InChI=1S/C19H17NO/c1-14-6-9-16(10-7-14)20-12-18-17-5-3-2-4-15(17)8-11-19(18)21-13-20/h2-11H,12-13H2,1H3
charge 0 multiplicity 1
38 atoms
O  -0.039053 2.360527 0.758738
N  -1.160078 0.316789 1.515318
C  0.039024 -0.546203 1.360364
C  1.146972 0.189643 0.598891
C  2.311586 -0.521016 0.132225
C  1.026658 1.560859 0.299505
C  -0.81214 1.662651 1.855963
C  -2.355972 0.030702 0.783545
C  3.310833 0.172483 -0.65757
C  2.001637 2.244395 -0.495174
C  3.116916 1.561792 -0.964362
C  2.524281 -1.912904 0.418851
C  -2.875694 -1.292465 0.767606
C  -3.076889 1.045864 0.097894
C  4.463342 -0.538969 -1.121794
C  3.660701 -2.581402 -0.046713
C  4.641865 -1.892643 -0.824737
C  -4.810141 -0.575979 -0.588259
C  -4.074249 -1.584456 0.086525
C  -4.28802 0.741198 -0.559145
C  -6.090895 -0.904077 -1.336529
H  -0.255829 -1.447847 0.796856
H  0.40056 -0.886907 2.353721
H  -1.694457 2.293552 2.023847
H  -0.148961 1.664078 2.742324
H  1.840248 3.306381 -0.703488
H  3.868001 2.082908 -1.569148
H  1.790406 -2.464375 1.016343
H  -2.361194 -2.086576 1.320755
H  -2.6762 2.063307 0.044056
H  5.208364 0.000577 -1.719161
H  3.80355 -3.642714 0.185893
H  -4.455429 -2.613316 0.096069
H  -4.824844 1.543352 -1.080915
H  5.526933 -2.428374 -1.184266
H  -5.878903 -1.225652 -2.37523
H  -6.64601 -1.724969 -0.847956
H  -6.76152 -0.028612 -1.39534
