program: Gaussian 09
title: 000022063
version: EM64L-G09RevD.01
frameworkgroup: C1[X(C5H5NOS)]
method: RPBEPBE
basis: SDD
operation: Freq
keyword: #p
keyword: freq=noraman
keyword: PBEPBE/SDD
title: #p freq=noraman PBEPBE/SDD
converged: NO NO NO NO
title: Mulliken charges:
elementType: S O N C C C C C H H H H H
charge: 0.332282 -0.269190 -0.623351 -0.235108 -0.213654 -0.133825 -0.510990 0.247967 0.230176 0.248553 0.268262 0.317627 0.341250
chargesum: 0.00000
title: Mulliken charges with hydrogens summed into heavy atoms:
elementType: S O N C C C C C
charge: 0.332282 -0.269190 0.035526 -0.235108 0.016523 0.114729 -0.242728 0.247967
polarizability: 1.06836228e+02 8.98550744e-01 8.88070960e+01 6.89209522e-03 8.49904636e-03 3.08618901e+01
1716.lowfreq: -12.4980 -2.9076 -0.0019 -0.0008 0.0011 11.5630 21.5643 170.0646 179.9247
frequency: 20.6026 170.0646 179.9229 351.4555 412.7208 439.8953 445.4597 533.3690 576.5042 586.9380 646.0831 699.5711 714.4712 719.2781 822.5149 828.1298 909.5890 1011.3712 1059.1436 1074.4952 1107.3928 1226.4878 1333.0935 1359.1543 1461.8432 1531.6228 1577.3991 1622.8507 3156.1080 3183.3208 3236.4237 3531.4157 3687.4669
redmass: 4.7556 4.8777 6.5035 4.8140 2.0205 7.5543 1.8003 1.5345 1.8884 4.2108 5.9981 6.7593 1.1974 5.1772 4.7269 1.4045 1.3721 3.1969 1.6633 1.6769 1.3758 1.4112 2.4805 4.2685 6.9021 4.9072 2.6541 1.7948 1.0916 1.0959 1.0999 1.0446 1.1044
irintensity: 11.7423 1.1048 10.0767 0.1241 18.7087 2.9987 122.7501 112.2477 23.1628 15.5559 4.4007 6.8503 153.0415 22.1316 8.9751 9.5284 0.2308 16.1133 5.2934 11.1248 6.2547 10.7593 33.0537 187.1294 67.6987 27.1574 157.4371 217.0806 8.0009 5.7011 0.7590 44.7259 30.3150
temp: 298.150 k
press: 1.00000 atm
elementType: 16 8 7 6 6 6 6 6 1 1 1 1 1
symmnumber: 1
zpe: 240546.0 jmol-1
zpe.correction: 0.091619 hartree
zpe.thermalcorrener: 0.099113 hartree
zpe.thermalcorrenthalpy: 0.100057 hartree
zpe.thermalcorrgfe: 0.058332 hartree
zpe.sumelectzpe: -720.985910 hartree
zpe.sumelectthermal: -720.978417 hartree
zpe.sumelectthermalent: -720.977472 hartree
zpe.sumelectthermalfe: -721.019197 hartree
dipole: 1.2254 4.6346 -0.0137
dipole: 4.7938
quadrupole: -44.2927 -50.7213 -57.5904
quadrupole: -9.4700 0.0326 0.0180
quadrupole: 6.5754 0.1468 -6.7223 -9.4700 0.0326 0.0180
hfenergy: -721.0775294 hartree
pointgroup: C01 [X(C5H5N1O1S1)]
dipole: 0.7036816 1.7498425 -0.0043424 debye
dipolederiv: 0.1280266 -0.0893903 -0.0004245 -0.0075947 -0.1893402 -0.0006815 -0.0001829 -0.0006214 0.1752269 -0.858133 -0.2187433 -0.0002852 -0.1225862 -0.856575 0.0000514 0.0004775 0.0039652 -0.371178 -0.7464858 0.4819069 -0.0037742 0.5063144 -0.830598 0.0003339 -0.0026039 -0.0021921 -0.7200974 -0.7309833 -0.0758193 -0.0001331 -0.3218307 0.3158121 0.0014378 -0.0022004 0.0016174 -0.1510643 0.1672764 -0.1604587 0.0000953 0.0496523 -0.1393692 0.0004124 -0.0016018 0.0001149 -0.1514953 -0.1253055 0.1351287 0.0003496 0.1853368 -0.1955798 0.0001567 0.0007595 0.000109 -0.1511264 -0.0600331 0.2075496 0.0006507 0.0042276 0.2202904 0.0012388 0.0001433 0.0011807 -0.312068 1.7382302 -0.2183817 0.0015841 -0.2063743 1.3255806 -0.0025486 0.0026122 -0.0034803 0.2881375 0.0858446 0.0763493 0.0000146 0.0860611 -0.0611285 -0.0006923 0.0002555 -0.0005798 0.1951316 0.002145 -0.0770215 -0.000232 -0.115005 0.0206962 -0.0006195 -0.0001857 -0.0006305 0.1998057 0.0053202 0.0394083 -0.0000376 0.0214608 0.0796407 -0.0003065 -0.0002623 -0.0002927 0.2187005 0.1895037 -0.076973 0.001411 -0.0715298 0.1387768 0.0007938 0.0017342 0.0004528 0.3892143 0.2045938 -0.0235552 0.0007813 -0.0081322 0.1717939 0.0004236 0.0010548 0.0003569 0.3908129 unknown
polarizability: 106.7813476|-1.3393348|88.8619467|0.0124725|0.0409305|30.8619195 unknown
InChI: InChI=1S/C5H5NOS/c6-5(7)4-2-1-3-8-4/h1-3H,6H2
charge 0 multiplicity 1
13 atoms
S  0.829962 -1.480678 -0.003026
O  -2.181502 -1.160487 0.005445
N  -2.290296 1.159289 -0.002294
C  -0.103752 0.067217 -0.001532
C  0.750744 1.167784 0.002682
C  2.145856 0.818784 0.003068
C  2.359583 -0.553323 -0.000281
C  -1.586551 -0.037205 -0.003548
H  0.405876 2.206372 0.005745
H  2.9554 1.552523 0.005621
H  3.305027 -1.093279 -0.001035
H  -1.840188 2.071215 -0.006925
H  -3.307859 1.103488 0.002181
