program: Gaussian 09
title: 000232665
version: EM64L-G09RevD.01
frameworkgroup: C1[X(C8H19NO3)]
method: RPBEPBE
basis: SDD
operation: Freq
keyword: #p
keyword: freq=noraman
keyword: PBEPBE/SDD
title: #p freq=noraman PBEPBE/SDD
converged: YES YES NO NO
title: Mulliken charges:
elementType: O O O N C C C C C C C C H H H H H H H H H H H H H H H H H H H
charge: -0.438442 -0.437747 -0.453206 -0.147909 0.319383 -0.416024 -0.389960 -0.427368 -0.706784 -0.754667 -0.326757 -0.321832 0.211211 0.225179 0.223973 0.196830 0.245984 0.231219 0.244409 0.213822 0.206109 0.236944 0.211208 0.222434 0.193242 0.233307 0.195108 0.191960 0.341928 0.331854 0.344593
chargesum: 0.00000
title: Mulliken charges with hydrogens summed into heavy atoms:
elementType: O O O N C C C C C C C C
charge: -0.096513 -0.105893 -0.108613 -0.147909 0.319383 0.020367 0.030843 0.049835 -0.042444 -0.084082 0.099791 0.065236
polarizability: 1.12591532e+02 2.81364086e+00 1.14804959e+02 -5.76637279e-01 7.55795220e-01 9.00340962e+01
1716.lowfreq: 0.0005 0.0006 0.0006 5.3104 15.1395 16.4286 49.4510 56.8290 83.8541
frequency: 49.3907 56.7642 83.8296 103.8040 117.8133 140.2242 151.0314 218.4695 221.7398 244.9668 265.3013 273.4947 276.8681 282.3241 301.9630 317.9513 326.6794 354.5588 375.0240 385.1801 422.2236 461.7467 557.0930 574.3221 709.6715 788.5109 803.5363 823.9407 882.6513 929.4806 951.3926 953.1668 963.3623 984.7433 987.9736 1004.4549 1012.4653 1028.3954 1059.5339 1102.9902 1112.5039 1151.6862 1171.6521 1195.6404 1204.9626 1240.4449 1250.2707 1269.3168 1291.2248 1295.3011 1323.5212 1339.1935 1340.8508 1351.6060 1368.0957 1371.8769 1378.3670 1391.6266 1405.2370 1454.0649 1461.2197 1462.5565 1471.3737 1477.2686 1480.3992 1488.2982 1492.2832 1500.8807 2920.7630 2939.7331 2965.1771 2968.3131 2977.9333 2984.2642 2992.1690 3004.8056 3043.7548 3066.5432 3071.7574 3074.2216 3079.9819 3087.8454 3089.1162 3097.7164 3559.7724 3572.9177 3573.5224
redmass: 5.5044 4.0968 4.7219 3.2827 1.9771 2.6888 2.2492 1.8716 1.4641 2.3562 1.3357 1.5010 1.6781 1.9302 2.9352 1.5592 2.1137 1.8705 1.9063 2.3051 2.2821 3.1114 2.7126 4.2418 3.4115 1.1638 1.2600 2.2903 1.7578 1.2838 4.3300 2.9940 2.1339 4.7487 2.9904 1.8963 1.9751 2.2502 2.2641 1.4430 1.3685 1.7978 2.0431 1.6779 1.2928 1.8922 1.7244 2.0306 1.2058 1.3997 1.2454 1.3429 1.2509 1.2260 1.2267 1.1822 1.2651 1.2120 1.3435 1.0704 1.0527 1.0740 1.0682 1.0693 1.0696 1.0698 1.0633 1.0587 1.0696 1.0547 1.0644 1.0688 1.0359 1.0358 1.1057 1.0630 1.0888 1.1024 1.0997 1.0989 1.0992 1.0974 1.0987 1.0974 1.0662 1.0668 1.0661
irintensity: 3.0942 0.1184 0.8650 4.1883 5.0855 9.9585 8.6451 2.5819 12.3278 23.2577 9.9093 95.1874 66.9474 3.8851 18.3423 87.2998 124.2811 9.4039 46.9655 12.3473 15.1327 21.8600 1.2910 4.2209 4.8727 12.0728 7.5212 4.2988 3.0623 16.2306 130.9291 88.9993 7.3965 59.4756 48.9747 23.1629 29.8896 4.8587 0.8936 42.9814 19.6072 17.9917 45.2052 25.6155 19.2370 31.9583 7.8854 11.4879 2.4999 11.2170 10.0449 24.7103 2.3450 14.1615 25.5562 8.5429 5.5858 21.9766 1.4732 6.1439 1.7878 1.3451 5.7489 9.2836 9.5354 10.1372 8.0992 12.1502 55.8008 56.5826 42.0231 57.2084 33.6770 13.6359 43.2233 42.0831 27.1169 37.2899 21.6076 13.6973 44.4421 36.7631 41.4799 31.1877 6.5246 2.6960 7.3978
temp: 298.150 k
press: 1.00000 atm
elementType: 8 8 8 7 6 6 6 6 6 6 6 6 1 1 1 1 1 1 1 1 1 1 1 1 1 1 1 1 1 1 1
symmnumber: 1
zpe: 707956.4 jmol-1
zpe.correction: 0.269646 hartree
zpe.thermalcorrener: 0.285218 hartree
zpe.thermalcorrenthalpy: 0.286162 hartree
zpe.thermalcorrgfe: 0.227757 hartree
zpe.sumelectzpe: -595.582813 hartree
zpe.sumelectthermal: -595.567242 hartree
zpe.sumelectthermalent: -595.566297 hartree
zpe.sumelectthermalfe: -595.624703 hartree
dipole: -0.2676 1.1822 1.1957
dipole: 1.7026
quadrupole: -88.0314 -72.8505 -74.7084
quadrupole: 8.1072 3.0965 8.2276
quadrupole: -9.5013 5.6796 3.8217 8.1072 3.0965 8.2276
hfenergy: -595.8524598 hartree
pointgroup: C01 [X(C8H19N1O3)]
dipole: 0.0389887 0.4761109 -0.4695716 debye
polarizability: 113.2997449|-3.0099239|114.0800934|-0.8618994|-0.6958816|90.0507492 unknown
InChI: InChI=1S/C8H19NO3/c1-8(2,7-12)9(3-5-10)4-6-11/h10-12H,3-7H2,1-2H3
charge 0 multiplicity 1
31 atoms
O  3.488164 -0.55442 0.365219
O  -3.59078 -1.908971 -0.066531
O  -0.782706 3.673891 0.153908
N  -0.274449 -0.052971 0.179397
C  1.045707 -0.603129 -0.269141
C  2.165354 0.027541 0.620964
C  -1.49519 -0.593159 -0.453883
C  -0.397856 1.349298 0.622631
C  1.370498 -0.319244 -1.76817
C  1.057859 -2.137857 -0.029195
C  -2.368216 -1.373592 0.557607
C  -0.273263 2.441401 -0.470325
H  1.880428 -0.080284 1.688624
H  2.298793 1.097082 0.387155
H  -1.251234 -1.26637 -1.295614
H  -2.107825 0.226885 -0.893289
H  0.320693 1.573839 1.429595
H  -1.401189 1.474099 1.072659
H  2.403137 -0.640252 -1.994268
H  1.29132 0.758219 -1.99701
H  0.681908 -0.865116 -2.439074
H  0.22611 -2.637284 -0.554652
H  1.991015 -2.586336 -0.417842
H  0.959836 -2.364326 1.048985
H  -2.607347 -0.728675 1.429728
H  -1.827034 -2.260864 0.921473
H  -0.880884 2.16467 -1.359281
H  0.782247 2.569509 -0.789975
H  3.516348 -1.468001 0.744833
H  -4.163504 -1.153562 -0.354049
H  -0.626937 4.444483 -0.447178
