program: Gaussian 09
title: 000232660
version: EM64L-G09RevD.01
frameworkgroup: C1[X(C9H17NO2)]
method: RPBEPBE
basis: SDD
operation: Freq
keyword: #p
keyword: freq=noraman
keyword: PBEPBE/SDD
title: #p freq=noraman PBEPBE/SDD
converged: YES YES NO NO
title: Mulliken charges:
elementType: O O N C C C C C C C C C H H H H H H H H H H H H H H H H H
charge: -0.315598 -0.311726 -0.136457 -0.401363 -0.371816 -0.371718 -0.393715 -0.393238 0.306627 -0.252191 -0.361870 -0.680627 0.190035 0.220656 0.209277 0.201824 0.200726 0.206249 0.260858 0.206656 0.201606 0.262263 0.208566 0.228368 0.205077 0.234847 0.206601 0.222240 0.217844
chargesum: 0.00000
title: Mulliken charges with hydrogens summed into heavy atoms:
elementType: O O N C C C C C C C C C
charge: -0.315598 -0.311726 -0.136457 0.009327 0.039284 0.035258 0.073800 0.070631 0.306627 0.184742 0.078054 -0.033941
polarizability: 1.41583940e+02 -1.55893685e+00 1.01866647e+02 8.53198399e-01 2.59556185e+00 8.77189892e+01
1716.lowfreq: -17.4513 -12.6703 -7.3559 0.0003 0.0004 0.0010 29.4480 48.4110 73.5459
frequency: 29.1923 47.4861 73.5104 82.5800 105.2192 152.8573 217.4558 234.5949 247.7356 271.3057 297.2835 345.7228 380.5904 413.6767 438.9239 511.6380 543.9976 610.8973 689.0144 731.4978 765.2433 802.6201 824.7163 846.1451 872.9663 887.9860 898.3143 929.1792 949.1089 993.3615 1021.3646 1046.7564 1058.6251 1087.6619 1120.7679 1126.9793 1136.9990 1154.6340 1160.3870 1218.1828 1248.1241 1249.4703 1256.1542 1274.7236 1293.6206 1306.9353 1327.2535 1335.9704 1341.8214 1345.6664 1354.7852 1370.1872 1390.4007 1408.8274 1454.1015 1455.0954 1461.4323 1464.9473 1470.2331 1475.8836 1478.7065 1478.7981 1487.3071 1638.6850 2949.6548 2954.6969 2966.6268 2976.5543 2985.8042 2987.3688 2997.9569 3018.2838 3036.0564 3046.9952 3047.0911 3055.4290 3072.4297 3080.7545 3089.3326 3097.6038 3116.3028
redmass: 3.5706 3.0601 4.0669 1.9025 4.5394 2.8774 1.1592 2.1838 2.1172 2.8289 3.5304 4.1643 1.7466 3.5857 3.1234 1.9913 4.9712 2.9199 11.7388 2.9678 1.2379 1.5007 2.9853 1.4346 2.2290 1.2265 2.2474 2.9945 1.3162 3.0324 2.9706 2.8998 2.4517 1.4135 2.2163 2.2352 2.3110 1.2909 1.6738 1.7751 2.3057 1.2577 1.2798 1.2532 1.1019 1.3134 1.2649 1.3768 1.5741 1.4163 1.3255 1.3672 1.2176 2.3777 1.0903 1.1266 1.0864 1.0933 1.0813 1.0559 1.0773 1.0589 1.0798 9.0986 1.0711 1.0702 1.0639 1.0358 1.0610 1.0610 1.0606 1.0574 1.0960 1.1026 1.1003 1.1032 1.1020 1.0990 1.0934 1.1084 1.0915
irintensity: 0.9231 0.7627 1.5844 0.4312 1.0208 0.3111 0.4563 1.9975 2.8681 1.3563 7.8883 19.6690 2.3757 3.0411 0.5679 3.5021 4.1174 0.5984 15.5280 18.1353 4.1356 0.4757 3.2281 16.6483 14.1555 3.3616 13.4607 19.8323 9.7578 10.9970 160.7970 6.7782 56.0209 0.8567 15.8902 3.0544 112.5936 0.1447 13.4576 232.1347 47.5287 5.0380 11.6447 19.0457 2.6091 6.6237 0.8584 2.0151 16.4939 1.3428 18.4146 2.3209 21.6633 106.7271 9.1370 56.5258 10.8493 14.1209 11.0467 4.0476 8.9805 14.9683 16.2742 403.5366 29.7631 69.7022 49.1375 36.7413 30.5348 32.7631 11.8907 60.7746 54.8663 32.1577 2.4322 92.6675 27.8981 42.0302 5.9154 46.4431 4.8494
temp: 298.150 k
press: 1.00000 atm
elementType: 8 8 7 6 6 6 6 6 6 6 6 6 1 1 1 1 1 1 1 1 1 1 1 1 1 1 1 1 1
symmnumber: 1
zpe: 664975.7 jmol-1
zpe.correction: 0.253276 hartree
zpe.thermalcorrener: 0.266252 hartree
zpe.thermalcorrenthalpy: 0.267196 hartree
zpe.thermalcorrgfe: 0.212707 hartree
zpe.sumelectzpe: -557.399370 hartree
zpe.sumelectthermal: -557.386394 hartree
zpe.sumelectthermalent: -557.385450 hartree
zpe.sumelectthermalfe: -557.439939 hartree
dipole: 1.4846 -2.1808 0.0682
dipole: 2.6390
quadrupole: -62.8302 -78.0121 -72.8304
quadrupole: 3.0204 -0.1198 0.0682
quadrupole: 8.3940 -6.7879 -1.6062 3.0204 -0.1198 0.0682
hfenergy: -557.6526459 hartree
pointgroup: C01 [X(C9H17N1O2)]
dipole: 0.5267377 0.8536791 0.2679504 debye
polarizability: 141.2230458|4.0695781|99.1566009|0.8406145|6.4772523|90.7899292 unknown
InChI: InChI=1S/C9H17NO2/c1-2-8-12-9(11)10-6-4-3-5-7-10/h2-8H2,1H3
charge 0 multiplicity 1
29 atoms
O  -1.286914 0.168891 0.885683
O  -0.752503 -1.723044 -0.413094
N  0.924242 -0.320423 0.447763
C  3.433908 0.995021 -0.233507
C  2.934236 -0.244345 -1.015962
C  2.240609 1.786578 0.354992
C  2.021266 -1.124511 -0.132317
C  1.337154 0.872895 1.21671
C  -0.38245 -0.710755 0.24708
C  -2.72566 -0.143266 0.675872
C  -3.25509 0.505584 -0.610962
C  -4.773379 0.270148 -0.773601
H  4.096446 0.663047 0.59331
H  4.041985 1.646055 -0.889325
H  2.365778 0.081279 -1.908754
H  3.789088 -0.851359 -1.370912
H  2.600604 2.629255 0.976145
H  1.637026 2.214884 -0.468977
H  1.568362 -1.948316 -0.706491
H  2.617756 -1.564399 0.695417
H  1.902446 0.539837 2.113924
H  0.436214 1.402201 1.556635
H  -3.220011 0.270789 1.57155
H  -2.852583 -1.240413 0.642946
H  -3.039193 1.590821 -0.584704
H  -2.711023 0.078478 -1.473303
H  -5.341107 0.699572 0.073654
H  -5.14663 0.739853 -1.701016
H  -5.006979 -0.809656 -0.825958
