program: Gaussian 09
title: 000232684
version: EM64L-G09RevD.01
frameworkgroup: C1[X(C12H20ClO5P)]
method: RPBEPBE
basis: SDD
operation: Freq
keyword: #p
keyword: freq=noraman
keyword: PBEPBE/SDD
title: #p freq=noraman PBEPBE/SDD
converged: NO YES NO NO
title: Mulliken charges:
elementType: Cl P O O O O O C C C C C C C C C C C C H H H H H H H H H H H H H H H H H H H H
charge: -0.180969 1.160616 -0.286932 -0.496733 -0.277087 -0.445036 -0.532170 0.302895 -0.168488 -0.019025 -0.422285 -0.426229 -0.444358 -0.417569 -0.374119 -0.332159 -0.424745 -0.375312 -0.311155 0.308774 0.220538 0.217928 0.239315 0.244212 0.269260 0.231428 0.213378 0.249005 0.208149 0.211529 0.210058 0.189393 0.230915 0.224304 0.191079 0.197809 0.216428 0.174810 0.222551
chargesum: 0.00000
title: Mulliken charges with hydrogens summed into heavy atoms:
elementType: Cl P O O O O O C C C C C C C C C C C C
charge: -0.180969 1.160616 -0.286932 -0.496733 -0.277087 -0.445036 -0.532170 0.302895 0.140286 0.201513 0.034958 0.087244 0.000447 0.039584 0.047469 0.088149 -0.009362 0.038924 0.086206
polarizability: 1.79546064e+02 5.29976344e+00 1.82131305e+02 -2.74770434e+00 7.86164982e-01 1.61320687e+02
1716.lowfreq: -15.7034 -9.8039 -1.9026 -0.0017 -0.0013 0.0017 36.1589 42.2049 57.1180
frequency: 36.0630 42.0976 57.0804 63.7717 88.6657 118.2326 127.7477 163.7214 181.7119 205.1216 216.3217 225.9944 243.6714 253.4481 259.3718 282.8061 289.6660 317.7482 330.4413 360.9301 399.4473 409.9185 426.6765 431.9878 435.6862 453.1988 506.7578 518.6341 538.3578 607.3204 621.3352 656.3404 720.6232 751.2390 789.0062 801.3575 823.8348 833.6067 843.9977 860.3652 864.0986 882.4736 889.2622 922.2661 932.5834 945.4374 958.2718 975.5458 1008.1128 1010.2338 1025.9883 1038.2050 1064.3269 1083.7499 1090.1951 1093.3819 1096.7734 1127.2467 1134.6773 1160.6966 1174.8094 1182.2369 1189.9771 1198.2410 1225.6892 1250.6572 1253.4403 1264.8511 1274.0634 1275.5071 1296.9469 1305.6181 1331.3261 1332.0255 1337.8665 1341.3466 1345.7119 1346.6272 1351.6076 1353.1883 1360.1160 1368.7896 1448.2238 1450.1222 1454.8060 1456.7785 1458.4657 1459.4519 1472.1941 1473.2563 1483.5161 2927.0137 2934.5643 2961.4842 2966.5048 2986.4374 2988.5607 2988.7075 3003.5570 3008.0528 3015.3155 3021.1517 3040.7560 3046.1794 3053.0003 3054.3643 3068.5398 3076.3293 3077.6450 3081.2536 3114.3823
redmass: 4.2238 6.4607 6.6622 3.8784 4.4829 3.6494 5.6051 3.7138 4.1965 6.6264 6.2612 2.6372 3.4297 3.7330 7.2236 5.7161 5.3988 1.9326 1.9612 3.0456 6.0635 3.9187 7.5777 4.4008 3.2363 3.6457 2.3027 2.1551 4.6728 2.8801 3.1542 6.9423 5.1540 4.5391 2.6414 1.9777 2.2654 1.9614 2.6063 2.5086 3.0201 3.3063 1.5477 3.5299 2.1483 2.7581 2.3250 1.8069 2.1517 3.2333 2.3813 2.4488 2.4483 3.1722 2.6189 2.3121 2.3609 2.2602 1.8400 1.7654 1.4940 1.4032 1.4446 1.6383 1.3318 1.3004 1.2233 1.2841 1.2296 1.3477 1.2466 1.3501 1.2725 1.3101 1.3703 1.3894 1.4321 1.4504 1.5742 1.4294 1.2911 1.3761 1.0905 1.0891 1.0836 1.0873 1.0865 1.0887 1.0843 1.0912 1.0867 1.0694 1.0818 1.0687 1.0645 1.0620 1.0621 1.0616 1.0620 1.0621 1.0790 1.0680 1.0959 1.0974 1.1019 1.1011 1.1022 1.0985 1.0973 1.0973 1.1018
irintensity: 0.2568 0.2696 0.1608 1.3790 0.7183 0.3723 2.1907 4.5184 0.6415 2.7057 0.2224 3.0726 1.6374 2.1082 12.4243 1.1337 9.3701 0.2770 0.9805 13.9940 14.4859 8.4208 105.9964 15.8622 2.1857 10.4230 0.8854 28.2789 2.3287 10.8587 11.6188 103.0048 55.0866 39.6622 2.2546 6.5379 10.7951 17.8853 3.9396 8.9180 15.8555 23.3094 5.2695 83.3043 0.2965 99.7069 56.3218 7.0016 32.9099 103.6480 31.1878 34.4389 2.4302 123.6793 54.2771 9.3720 7.6457 3.0753 3.3411 0.6230 5.1839 8.4350 13.4039 8.9144 2.6402 1.8549 8.1799 3.0638 6.7975 4.9336 12.7146 6.1616 0.2150 3.5373 0.5197 1.4679 2.3661 3.7376 9.2493 17.6562 5.0331 3.6435 5.8010 10.6566 3.0168 22.5406 14.3360 4.8525 3.2033 9.5889 16.0349 63.2382 33.9935 53.8075 37.6658 32.1091 40.6134 25.1979 26.3173 16.2713 1.6283 14.7902 41.1456 34.8437 53.3350 42.4078 29.7039 8.9151 61.7212 32.5728 8.1238
temp: 298.150 k
press: 1.00000 atm
elementType: 17 15 8 8 8 8 8 6 6 6 6 6 6 6 6 6 6 6 6 1 1 1 1 1 1 1 1 1 1 1 1 1 1 1 1 1 1 1 1
symmnumber: 1
zpe: 828587.9 jmol-1
zpe.correction: 0.315592 hartree
zpe.thermalcorrener: 0.334638 hartree
zpe.thermalcorrenthalpy: 0.335582 hartree
zpe.thermalcorrgfe: 0.268190 hartree
zpe.sumelectzpe: -1645.141335 hartree
zpe.sumelectthermal: -1645.122290 hartree
zpe.sumelectthermalent: -1645.121346 hartree
zpe.sumelectthermalfe: -1645.188737 hartree
dipole: 3.8814 6.9079 -0.3802
dipole: 7.9328
quadrupole: -127.5706 -125.4693 -134.4175
quadrupole: -12.9347 7.8491 2.4666
quadrupole: 1.5819 3.6832 -5.2651 -12.9347 7.8491 2.4666
hfenergy: -1645.4569275 hartree
pointgroup: C01[X(C12H20Cl1O5P1)]
dipole: -1.0797889 2.7439116 -1.0225701 debye
polarizability: 178.3583748|-4.5531677|180.2543381|0.8189272|-8.2702789|164.3853431 unknown
InChI: InChI=1S/C12H20O5P.Cl/c13-18-16-9-12(6-2-4-8-15-12)11(17-18)10-5-1-3-7-14-10;/h10-11H,1-9H2;
charge 0 multiplicity 1
39 atoms
Cl 1.812269 -2.223789 2.897382
P  1.951792 -2.11483 0.619032
O  0.241981 2.018992 0.873734
O  0.369156 -1.631974 0.144903
O  -2.390379 -0.570641 1.413481
O  2.872915 -0.668966 0.375875
O  2.510677 -3.392913 -0.104333
C  0.829009 0.82867 0.211726
C  -0.139423 -0.314363 0.661148
C  -1.606222 -0.178289 0.218945
C  0.910883 1.012377 -1.321851
C  2.222871 0.586135 0.864396
C  1.587166 2.346244 -1.719483
C  -2.034982 -1.026708 -0.998631
C  0.873208 3.528747 -1.025362
C  0.854379 3.317131 0.496897
C  -3.549519 -0.840156 -1.258966
C  -4.361086 -1.178883 0.013854
C  -3.8347 -0.359374 1.206293
H  -0.142569 -0.34897 1.768412
H  -1.795092 0.901397 0.020673
H  -0.116202 1.010875 -1.731052
H  1.4442 0.153869 -1.769136
H  2.954693 1.361313 0.593617
H  2.11619 0.542016 1.964527
H  1.547238 2.463328 -2.817597
H  2.661046 2.340083 -1.44692
H  -1.810523 -2.086098 -0.784614
H  -1.447362 -0.74609 -1.892387
H  1.379326 4.486731 -1.252019
H  -0.166661 3.606262 -1.398138
H  1.882397 3.387261 0.910781
H  0.223192 4.059953 1.011312
H  -3.869396 -1.478891 -2.10282
H  -3.75092 0.210928 -1.555533
H  -5.437779 -0.966522 -0.135154
H  -4.259583 -2.256939 0.242895
H  -4.026049 0.725275 1.038376
H  -4.302642 -0.661889 2.157635
