program: Gaussian 09
title: 000232661
version: EM64L-G09RevD.01
frameworkgroup: C1[X(C10H19NO2)]
method: RPBEPBE
basis: SDD
operation: Freq
keyword: #p
keyword: freq=noraman
keyword: PBEPBE/SDD
title: #p freq=noraman PBEPBE/SDD
converged: YES YES NO NO
title: Mulliken charges:
elementType: O O N C C C C C C C C C C H H H H H H H H H H H H H H H H H H H
charge: -0.323111 -0.313574 -0.137195 -0.400509 -0.372385 -0.372357 -0.391946 -0.391376 0.309301 -0.042537 -0.276392 -0.692048 -0.698252 0.190051 0.220633 0.208489 0.202029 0.201005 0.204761 0.261855 0.206326 0.201908 0.261655 0.205200 0.209080 0.235640 0.207860 0.216229 0.226643 0.218650 0.211582 0.212786
chargesum: 0.00000
title: Mulliken charges with hydrogens summed into heavy atoms:
elementType: O O N C C C C C C C C C C
charge: -0.323111 -0.313574 -0.137195 0.010175 0.038133 0.033409 0.076234 0.072187 0.309301 0.162663 0.168328 -0.041317 -0.055233
polarizability: 1.53821505e+02 -2.46283980e+00 1.09818342e+02 3.13406204e+00 3.81709512e+00 1.00302772e+02
1716.lowfreq: -23.0126 -13.0715 0.0004 0.0005 0.0006 6.5464 15.4188 31.2901 54.5643
frequency: -4.3292 28.7906 54.3991 72.2038 97.8407 152.0251 195.9813 222.6600 231.1743 241.1099 258.9305 286.7191 350.0461 360.3449 381.2303 410.4647 417.9164 443.0126 510.4165 559.7875 610.0316 685.3100 741.4683 806.4519 812.4958 828.9175 850.7242 884.5631 908.8397 917.8977 924.5098 951.9344 953.9952 963.1588 995.2648 1022.2432 1059.6492 1088.7506 1129.4101 1133.7737 1136.3877 1156.3249 1168.5594 1186.5250 1218.4141 1249.2673 1252.8213 1256.3781 1276.0588 1294.5612 1329.9580 1338.5030 1339.7069 1345.4134 1348.4859 1352.4993 1367.4421 1376.1625 1393.3692 1409.4264 1455.8711 1457.4414 1464.4536 1468.0966 1469.5346 1471.1496 1474.9305 1481.2583 1482.1957 1489.3927 1639.7171 2946.1585 2951.6326 2966.7060 2971.0555 2978.4342 2981.1473 2985.5309 2987.9657 3003.7005 3036.5645 3046.9349 3055.2326 3062.8260 3071.4002 3075.5942 3079.5567 3082.1451 3089.8232 3115.5800
redmass: 3.0697 3.5489 2.7263 3.8814 5.6188 2.8273 1.1154 1.5192 1.8751 1.9595 2.3648 2.9577 4.3049 2.5439 1.7309 1.9168 3.0891 2.9769 2.0241 4.8482 2.8722 11.7433 4.7961 1.5075 2.5912 3.1118 1.3972 2.7724 1.7144 1.3455 1.6919 1.5908 1.4487 1.6180 2.9569 2.9635 2.3814 1.3943 2.3877 2.2214 2.3057 1.2586 1.8929 1.8258 1.7818 2.3108 1.2224 1.2908 1.2499 1.3408 1.2829 1.3609 1.5604 1.4248 1.3863 1.3547 1.3489 1.2194 1.2564 2.3493 1.0869 1.0900 1.0870 1.0834 1.0490 1.0724 1.0824 1.0608 1.0847 1.0538 9.1520 1.0713 1.0705 1.0639 1.0355 1.0354 1.0839 1.0613 1.0609 1.0567 1.0959 1.1026 1.1031 1.1003 1.1016 1.1022 1.1012 1.1009 1.0928 1.0912
irintensity: 0.2927 1.0930 0.2194 1.2806 1.6407 0.5970 0.2455 2.2773 3.3139 0.3483 0.3588 4.1420 20.5654 4.0475 2.2828 2.6932 1.4180 0.2827 3.0529 4.5927 0.4561 14.7821 18.1721 0.5174 3.9706 6.7508 17.1474 8.9087 4.6818 1.4389 25.0789 9.3710 17.5826 7.1698 27.2559 190.0398 57.9358 0.6896 4.0524 60.8166 59.4313 0.4060 7.4049 1.6632 243.0616 45.8040 5.9070 8.7898 20.7490 0.9445 1.0610 2.4883 14.6765 3.3368 2.2290 7.5004 4.7780 16.6441 31.8785 137.7153 13.1950 6.9359 12.5371 28.6524 2.9070 10.9114 14.9361 13.0861 13.9018 22.9148 377.4024 29.3280 79.7969 43.6245 35.0368 23.8282 14.4885 30.8452 34.8885 53.7518 56.7772 34.4092 92.1720 25.9743 7.3122 48.5891 45.7474 52.9494 6.5124 5.1537
temp: 298.150 k
press: 1.00000 atm
elementType: 8 8 7 6 6 6 6 6 6 6 6 6 6 1 1 1 1 1 1 1 1 1 1 1 1 1 1 1 1 1 1 1
symmnumber: 1
zpe: 736796.4 jmol-1
zpe.correction: 0.280631 hartree
zpe.thermalcorrener: 0.294127 hartree
zpe.thermalcorrenthalpy: 0.295071 hartree
zpe.thermalcorrgfe: 0.239992 hartree
zpe.sumelectzpe: -596.623607 hartree
zpe.sumelectthermal: -596.610111 hartree
zpe.sumelectthermalent: -596.609167 hartree
zpe.sumelectthermalfe: -596.664245 hartree
dipole: 1.2989 -2.3517 -0.5156
dipole: 2.7356
quadrupole: -68.3280 -85.3247 -79.7183
quadrupole: 1.5989 0.5267 -0.9694
quadrupole: 9.4623 -7.5344 -1.9279 1.5989 0.5267 -0.9694
hfenergy: -596.9042377 hartree
pointgroup: C01 [X(C10H19N1O2)]
dipole: 0.4499877 0.8487343 0.4852667 debye
polarizability: 153.3994174|5.7854298|107.2850094|-1.171025|5.8860947|103.2581923 unknown
InChI: InChI=1S/C10H19NO2/c1-9(2)8-13-10(12)11-6-4-3-5-7-11/h9H,3-8H2,1-2H3
charge 0 multiplicity 1
32 atoms
O  -1.048801 -0.196856 0.845443
O  -0.344854 -1.788921 -0.747421
N  1.193088 -0.389459 0.34096
C  3.628864 1.174309 -0.002006
C  3.230611 0.070832 -1.011705
C  2.370621 1.778748 0.66618
C  2.355517 -1.006578 -0.333844
C  1.502029 0.677045 1.318026
C  -0.07214 -0.868885 0.074151
C  -3.26662 0.545766 -0.001161
C  -2.459413 -0.607934 0.62375
C  -2.715157 0.934116 -1.390813
C  -4.755955 0.130289 -0.076489
H  4.28339 0.735334 0.780238
H  4.216157 1.965499 -0.504759
H  2.664871 0.519893 -1.851241
H  4.131206 -0.410185 -1.438947
H  2.656891 2.516206 1.440558
H  1.767326 2.313123 -0.093746
H  1.971873 -1.738372 -1.06226
H  2.959068 -1.554837 0.421643
H  2.058882 0.230106 2.170409
H  0.557038 1.084088 1.703994
H  -3.179012 1.423719 0.67141
H  -2.848953 -0.868171 1.624385
H  -2.46702 -1.50046 -0.028948
H  -3.296145 1.769533 -1.823187
H  -2.768566 0.077604 -2.088756
H  -1.658928 1.250259 -1.323916
H  -5.369223 0.954052 -0.484298
H  -5.159361 -0.132044 0.919923
H  -4.886584 -0.746219 -0.739775
