program: Gaussian 09
title: 000232713
version: EM64L-G09RevD.01
frameworkgroup: C1[X(C18H22N2S)]
method: RPBEPBE
basis: SDD
operation: Freq
keyword: #p
keyword: freq=noraman
keyword: PBEPBE/SDD
title: #p freq=noraman PBEPBE/SDD
converged: YES YES NO NO
title: Mulliken charges:
elementType: S N N C C C C C C C C C C C C C C C C C C H H H H H H H H H H H H H H H H H H H H H H
charge: 0.185839 -0.058629 -0.179779 -0.356460 -0.365095 -0.396292 -0.381240 -0.662428 0.470559 -0.377852 -0.379934 -0.199764 -0.233483 -0.225194 -0.267520 -0.270410 -0.176425 0.444382 -0.371056 -0.400363 -0.806018 0.194113 0.233573 0.212268 0.203775 0.212936 0.219849 0.209211 0.213630 0.248680 0.271350 0.232674 0.215404 0.218944 0.219076 0.225797 0.247966 0.284569 0.230294 0.229208 0.223722 0.224127 0.235997
chargesum: 0.00000
title: Mulliken charges with hydrogens summed into heavy atoms:
elementType: S N N C C C C C C C C C C C C C C C C C C
charge: 0.185839 -0.058629 -0.179779 0.071226 0.050948 0.036493 0.041602 -0.142399 0.470559 -0.145177 -0.164530 -0.199764 -0.014540 -0.006118 -0.041723 -0.022444 0.108144 0.444382 -0.140762 -0.171155 -0.122172
polarizability: 3.23531037e+02 -5.54976952e+00 2.04108164e+02 -2.82012578e+00 6.57931437e+00 1.68877127e+02
1716.lowfreq: -4.1719 -1.6814 -0.0010 0.0008 0.0012 7.8505 15.8062 19.6211 21.8740
frequency: 13.4776 19.0478 21.8700 31.0006 44.9365 63.1350 76.6618 101.2368 133.0652 144.1834 192.3803 207.1020 246.4524 273.4057 275.3907 299.6312 316.4394 344.8219 358.0543 375.9769 401.6803 407.7023 410.0501 432.9711 469.7711 496.5953 510.6828 520.9785 601.8562 613.8653 615.8393 632.0425 676.0390 692.0290 711.0164 717.5082 756.3436 760.9352 785.9500 817.0825 820.7209 845.8890 854.5339 875.1202 902.1899 918.9634 956.1210 956.9815 975.5215 977.9409 981.9885 983.8619 987.3792 1000.1287 1006.5109 1031.6324 1046.7106 1050.0248 1063.0382 1073.5587 1086.6311 1089.1861 1116.5428 1135.3379 1151.3220 1169.9848 1173.6491 1190.6049 1199.9596 1204.2956 1219.3739 1233.9693 1242.5830 1275.8318 1298.0517 1301.5991 1304.8066 1326.1620 1343.1083 1353.1214 1358.4517 1358.9000 1374.5340 1382.4985 1386.3408 1395.8362 1397.0240 1437.8399 1445.7561 1456.0108 1458.3885 1463.3163 1469.5083 1470.8726 1473.6171 1482.2517 1495.4258 1573.7697 1579.4727 1607.0584 1617.6358 2870.2790 2879.0092 2907.0506 2911.0741 2916.0097 2974.0616 3032.5068 3040.5208 3055.0540 3061.2840 3077.5539 3083.9808 3093.3371 3116.6136 3120.2443 3121.8914 3128.3959 3142.6765 3148.5556 3150.5374 3158.2545 3169.5405
redmass: 4.4791 1.4813 1.8521 3.4905 4.7757 3.1299 5.1274 4.6922 4.2588 5.0112 3.2953 3.4267 2.1124 4.0022 3.4602 3.3485 2.7282 3.1630 7.3238 2.0801 3.9765 2.9455 3.0265 3.7425 2.7174 2.7676 3.7839 3.2195 5.2747 5.8710 2.8019 6.8744 4.8354 1.8039 3.4582 3.9183 1.9453 3.3209 4.9619 1.2775 1.3501 1.5659 1.2459 1.4921 1.7469 3.7631 1.3188 1.3812 1.4171 3.8847 1.7711 1.4119 1.4137 2.6456 3.8283 2.1587 1.5588 1.8150 2.1259 2.9471 2.2201 1.6737 1.3194 2.4801 2.5926 1.3885 1.4913 1.1219 1.1435 1.1154 2.9318 1.4669 1.5500 1.2017 1.3749 1.3181 1.4524 1.3797 1.3693 1.4348 2.1360 3.0774 1.7953 1.7668 2.3384 1.2629 2.9334 1.0989 2.4426 1.0845 1.1014 1.1121 1.1193 1.0900 1.0546 2.3633 2.3568 6.1414 5.9452 6.1461 6.0487 1.0704 1.0694 1.0702 1.0702 1.0679 1.0386 1.0906 1.0901 1.0950 1.0903 1.0941 1.0997 1.0888 1.0888 1.0883 1.0843 1.0882 1.0961 1.0923 1.0964 1.0941 1.0995
irintensity: 0.1948 0.2844 0.5167 0.1070 0.9366 1.5566 2.7316 1.1465 0.8364 1.6568 4.0567 2.6896 1.8219 2.5416 3.6702 6.6552 3.6124 1.2585 4.1011 2.2066 1.8533 0.7459 0.3287 0.5132 1.9244 21.9014 7.6179 12.5032 2.7073 0.4897 10.2672 0.7606 36.6000 41.5273 0.6169 5.8350 80.2646 4.8391 1.8297 0.7885 49.9205 0.8357 1.5511 4.1629 6.7108 25.5805 0.9055 0.1335 0.8428 3.6033 5.3692 0.2641 0.9973 163.9867 7.6960 9.0954 20.2261 1.9921 3.2069 18.4120 0.6486 6.5789 7.9410 115.7485 47.4453 4.6340 9.8773 5.2055 0.9935 2.9629 0.9878 133.5942 47.8075 43.8830 36.9193 12.3359 23.7640 0.3906 3.9388 6.1219 11.9039 4.8920 37.1218 2.6769 26.1396 9.3025 2.1379 5.7074 0.9726 8.8689 1.2378 58.9399 12.7047 13.3867 12.9453 81.4497 139.6960 0.3130 10.2263 2.2351 174.4602 62.6740 76.7011 18.9077 113.1018 165.1015 43.1924 41.0250 18.9709 23.6302 26.7041 11.8447 18.0594 21.6272 16.4078 16.4748 9.9439 8.0550 11.7373 40.4290 13.4075 41.0828 6.5945
temp: 298.150 k
press: 1.00000 atm
elementType: 16 7 7 6 6 6 6 6 6 6 6 6 6 6 6 6 6 6 6 6 6 1 1 1 1 1 1 1 1 1 1 1 1 1 1 1 1 1 1 1 1 1 1
symmnumber: 1
zpe: 939888.5 jmol-1
zpe.correction: 0.357985 hartree
zpe.thermalcorrener: 0.378099 hartree
zpe.thermalcorrenthalpy: 0.379044 hartree
zpe.thermalcorrgfe: 0.305028 hartree
zpe.sumelectzpe: -1205.111348 hartree
zpe.sumelectthermal: -1205.091233 hartree
zpe.sumelectthermalent: -1205.090289 hartree
zpe.sumelectthermalfe: -1205.164305 hartree
dipole: 0.6390 0.7246 1.5137
dipole: 1.7958
quadrupole: -133.8467 -131.4344 -127.6585
quadrupole: 5.5615 1.6027 -0.2024
quadrupole: -2.8668 -0.4546 3.3214 5.5615 1.6027 -0.2024
hfenergy: -1205.4693328 hartree
pointgroup: C01 [X(C18H22N2S1)]
dipole: -0.2244815 -0.2827565 0.6072994 debye
polarizability: 323.6791549|-3.9308689|203.8267561|-2.8140496|-6.7540822|169.0104166 unknown
InChI: InChI=1S/C18H22N2S/c1-16-7-9-18(10-8-16)21-15-19-11-13-20(14-12-19)17-5-3-2-4-6-17/h2-10H,11-15H2,1H3
charge 0 multiplicity 1
43 atoms
S  -2.829686 2.297494 -0.397409
N  -0.300119 1.395231 0.522004
N  2.40036 0.478206 0.081866
C  0.533943 1.991384 -0.5443
C  0.530726 0.93543 1.66193
C  1.592969 0.992441 -1.041998
C  1.566358 -0.087699 1.166662
C  -1.442204 2.217743 0.913573
C  3.693196 -0.053859 -0.167149
C  4.207114 -0.188025 -1.492926
C  4.547264 -0.434109 0.914115
C  -3.654492 0.66571 -0.154288
C  5.516535 -0.664721 -1.718025
C  5.847434 -0.919456 0.675842
C  6.351021 -1.037886 -0.641698
C  -5.069376 0.627084 -0.153031
C  -2.917945 -0.534264 -0.012423
C  -5.020592 -1.823145 0.138625
C  -5.739052 -0.609062 -0.016218
C  -3.603024 -1.759404 0.147874
C  -5.748068 -3.151101 0.262324
H  1.04801 2.916157 -0.180718
H  -0.12895 2.26948 -1.384055
H  -0.125862 0.455134 2.411228
H  1.06398 1.785488 2.154699
H  1.086554 0.164683 -1.591535
H  2.252371 1.522634 -1.750038
H  2.201534 -0.395598 2.010945
H  1.024421 -0.991186 0.801433
H  -1.195523 3.293499 1.064742
H  -1.891324 1.813649 1.8354
H  3.583033 0.055387 -2.357487
H  4.209054 -0.321182 1.949336
H  5.878521 -0.75669 -2.748915
H  6.477931 -1.194231 1.529714
H  7.364283 -1.411439 -0.821695
H  -5.640463 1.557172 -0.245774
H  -1.823471 -0.492806 -0.026515
H  -6.835997 -0.626591 -0.017385
H  -3.023811 -2.68388 0.266218
H  -5.144605 -3.89492 0.811749
H  -6.712499 -3.037679 0.788677
H  -5.968252 -3.57887 -0.735373
