program: Gaussian 09
title: 000232657
version: EM64L-G09RevD.01
frameworkgroup: C1[X(C10H20N2O3)]
method: RPBEPBE
basis: SDD
operation: Freq
keyword: #p
keyword: freq=noraman
keyword: PBEPBE/SDD
title: #p freq=noraman PBEPBE/SDD
converged: YES YES NO NO
title: Mulliken charges:
elementType: O O O N N C C C C C C C C C C H H H H H H H H H H H H H H H H H H H H
charge: -0.317005 -0.435023 -0.310906 -0.080461 -0.142277 -0.335754 -0.352168 -0.398050 -0.390825 -0.321434 -0.417975 0.311484 -0.321782 -0.247204 -0.665587 0.214764 0.186191 0.191379 0.214140 0.254723 0.216446 0.221271 0.252286 0.179056 0.201177 0.203927 0.224651 0.182688 0.214090 0.215266 0.235356 0.331795 0.213099 0.252118 0.220547
chargesum: 0.00000
title: Mulliken charges with hydrogens summed into heavy atoms:
elementType: O O O N N C C C C C C C C C C
charge: -0.317005 -0.103229 -0.310906 -0.080461 -0.142277 0.065202 0.053351 0.073119 0.082732 0.058799 0.010602 0.311484 0.074996 0.203418 0.020176
polarizability: 1.75929996e+02 -2.51327623e+00 1.21155102e+02 4.64417987e+00 3.53484118e+00 1.05825180e+02
1716.lowfreq: -6.0369 -0.0007 0.0006 0.0009 8.3885 16.4918 26.0717 44.7825 57.4789
frequency: 25.5874 44.6832 57.4475 62.5876 67.6863 96.6306 111.6789 122.4844 152.4787 193.0778 218.1264 226.8196 265.0463 281.5743 309.8520 324.4265 327.3492 367.0245 396.2284 429.4138 459.6577 487.1955 512.1787 568.5464 627.8592 691.9811 736.3748 760.4505 774.2855 808.6979 840.5236 840.7815 870.5911 942.5729 955.2829 972.5553 1003.7406 1026.8526 1047.9522 1051.7074 1058.6877 1068.8846 1082.8999 1095.8936 1100.5136 1133.8643 1149.0330 1152.8495 1170.3378 1200.6178 1209.2411 1226.5393 1266.9238 1275.8424 1279.6905 1283.5841 1286.7701 1298.1766 1330.2213 1337.2177 1348.9025 1353.0530 1368.4147 1369.7685 1384.3929 1387.6221 1396.7566 1411.1836 1454.8798 1456.1931 1460.4083 1462.6079 1463.1707 1467.8633 1469.1254 1475.8719 1485.0668 1488.5282 1641.1753 2837.5064 2849.5683 2864.6716 2947.5352 2976.4075 2979.5201 2983.9690 2989.9020 2997.9347 3026.9872 3034.6860 3046.1677 3055.3352 3074.2967 3084.0409 3089.7356 3094.9665 3115.5809 3118.9915 3559.1582
redmass: 4.5041 2.1159 2.8174 2.6928 4.4660 4.3281 6.0615 2.9619 2.7755 2.4425 1.3478 4.1285 1.9023 2.6064 2.1510 2.5193 1.3456 4.4404 2.0545 3.5856 2.9894 3.1046 4.2176 3.9024 2.2646 11.1245 3.2589 3.4029 1.1009 1.3209 1.8369 2.4187 1.2300 2.3368 4.3785 2.6694 2.5890 2.9466 2.7534 2.2063 2.4488 2.5950 1.9129 2.1250 1.9995 2.4856 2.5932 1.6626 1.6670 1.1134 2.1782 1.6648 1.7552 1.2991 1.2725 1.1186 1.2124 1.3684 1.2731 1.2608 1.3092 1.2586 1.3898 1.3566 1.2658 1.2374 1.4497 2.4777 1.0810 1.1096 1.0789 1.0493 1.0969 1.0761 1.1010 1.0937 1.0534 1.0935 9.0964 1.0705 1.0713 1.0694 1.0691 1.0690 1.0680 1.0606 1.0361 1.0871 1.0590 1.0894 1.0959 1.0888 1.0996 1.0980 1.1030 1.0951 1.1055 1.0928 1.0662
irintensity: 0.4990 3.2611 3.2439 1.7795 3.5325 2.3355 1.0676 2.7611 1.4376 2.7158 3.8165 2.1384 1.3566 7.9116 15.7559 64.5325 96.2148 30.7006 0.4274 3.1135 4.2735 5.7946 6.6264 4.5745 1.5672 17.2684 12.9838 8.0687 8.7501 2.9322 0.9022 9.3784 3.3533 18.8432 106.2652 37.2199 36.9861 30.9121 20.3669 37.7807 75.7674 61.0405 28.3973 40.8540 55.5111 35.6302 31.9506 41.9788 21.3951 9.5905 74.3984 222.3731 32.4733 3.8787 11.6027 5.4447 7.7223 29.6285 22.1420 3.2872 8.9731 8.5471 2.8816 2.0158 36.3895 28.9953 6.6265 120.7309 4.9320 55.1246 18.9702 17.9998 4.2829 1.0729 8.2642 0.5981 17.3848 9.5117 424.7980 52.9629 51.0137 153.2515 63.7728 22.3904 73.6610 26.4274 20.6820 23.7114 41.7901 44.0002 26.9833 41.7824 56.9363 38.4142 5.4978 5.5935 34.0637 4.7705 7.4220
temp: 298.150 k
press: 1.00000 atm
elementType: 8 8 8 7 7 6 6 6 6 6 6 6 6 6 6 1 1 1 1 1 1 1 1 1 1 1 1 1 1 1 1 1 1 1 1
symmnumber: 1
zpe: 790371.1 jmol-1
zpe.correction: 0.301036 hartree
zpe.thermalcorrener: 0.317903 hartree
zpe.thermalcorrenthalpy: 0.318847 hartree
zpe.thermalcorrgfe: 0.254922 hartree
zpe.sumelectzpe: -726.997917 hartree
zpe.sumelectthermal: -726.981051 hartree
zpe.sumelectthermalent: -726.980107 hartree
zpe.sumelectthermalfe: -727.044031 hartree
dipole: -0.5247 -0.3905 -0.5966
dipole: 0.8853
quadrupole: -104.6558 -93.7953 -88.8436
quadrupole: -19.4431 4.6703 1.0217
quadrupole: -8.8909 1.9696 6.9213 -19.4431 4.6703 1.0217
hfenergy: -727.2989534 hartree
pointgroup: C01 [X(C10H20N2O3)]
dipole: -0.2076485 -0.1428747 -0.2403846 debye
polarizability: 176.0539808|-2.2478409|120.7019309|3.7774338|4.3759384|106.1543658 unknown
InChI: InChI=1S/C10H20N2O3/c1-2-15-10(14)12-7-5-11(6-8-12)4-3-9-13/h13H,2-9H2,1H3
charge 0 multiplicity 1
35 atoms
O  3.149472 -0.874542 -0.609047
O  -6.24804 -1.29503 -0.142427
O  3.367542 1.339068 0.168878
N  -1.543358 0.483445 -0.079528
N  1.293593 0.487852 -0.527601
C  -0.801056 -0.795264 -0.225782
C  -0.675714 1.512383 0.553758
C  0.463504 -0.596497 -1.085248
C  0.581778 1.75942 -0.29888
C  -2.830162 0.332421 0.645254
C  -3.873678 -0.498788 -0.130693
C  2.64771 0.404734 -0.283525
C  -5.263956 -0.431422 0.529286
C  4.599553 -1.071879 -0.330657
C  4.833078 -1.476581 1.127802
H  -1.448446 -1.537035 -0.724704
H  -0.506844 -1.20998 0.773119
H  -0.361916 1.209454 1.5855
H  -1.247676 2.455323 0.63477
H  1.057916 -1.520354 -1.122965
H  0.155287 -0.325532 -2.115793
H  0.280492 2.19119 -1.274692
H  1.272405 2.456063 0.202602
H  -2.68208 -0.116845 1.662641
H  -3.235395 1.352079 0.80437
H  -3.925911 -0.110857 -1.168254
H  -3.577861 -1.562868 -0.188695
H  -5.622161 0.621104 0.565836
H  -5.226729 -0.819057 1.562036
H  4.889999 -1.870624 -1.032804
H  5.13497 -0.137487 -0.574046
H  -6.333376 -1.005452 -1.086061
H  5.904569 -1.700568 1.28776
H  4.547316 -0.655432 1.806282
H  4.249875 -2.377841 1.386006
