program: Gaussian 09
title: 000232658
version: EM64L-G09RevD.01
frameworkgroup: C1[X(C12H24N2O3)]
method: RPBEPBE
basis: SDD
operation: Freq
keyword: #p
keyword: freq=noraman
keyword: PBEPBE/SDD
title: #p freq=noraman PBEPBE/SDD
converged: YES YES NO NO
title: Mulliken charges:
elementType: O O O N N C C C C C C C C C C C C H H H H H H H H H H H H H H H H H H H H H H H H
charge: -0.270897 -0.316720 -0.311875 -0.077170 -0.141818 -0.350207 -0.334526 -0.391889 -0.400409 -0.334283 -0.418502 -0.263922 0.310473 -0.204881 -0.247090 -0.677405 -0.666156 0.213375 0.189105 0.183282 0.218723 0.251312 0.221870 0.217961 0.253664 0.173744 0.200584 0.229321 0.219181 0.180156 0.183507 0.183659 0.184923 0.234891 0.214967 0.228722 0.201354 0.227749 0.220254 0.252511 0.212458
chargesum: 0.00000
title: Mulliken charges with hydrogens summed into heavy atoms:
elementType: O O O N N C C C C C C C C C C C C
charge: -0.270897 -0.316720 -0.311875 -0.077170 -0.141818 0.052273 0.067479 0.081293 0.071217 0.040046 0.030000 0.099742 0.310473 0.163701 0.202768 -0.019580 0.019067
polarizability: 2.11906653e+02 -3.15126919e+00 1.41970120e+02 4.67504606e+00 3.32535414e+00 1.21449263e+02
1716.lowfreq: -14.3295 -1.9555 -0.0005 0.0004 0.0007 4.8178 17.6893 26.9607 39.3616
frequency: 17.4266 26.5770 39.1327 44.9248 58.3222 72.2169 93.3041 99.9896 109.5022 126.5751 133.5546 168.3836 195.7651 207.0772 219.8581 235.4110 263.0315 303.5590 311.2825 320.4849 351.4709 396.0034 415.3763 452.8226 468.3767 491.8234 511.9596 572.4636 627.6782 691.4021 736.1271 760.6137 774.5922 807.8118 814.5607 837.0667 841.5903 845.0116 879.1720 942.3887 970.5831 987.7666 1009.3078 1026.7768 1051.3100 1061.6315 1068.5629 1070.4013 1076.0924 1089.1604 1096.0935 1117.7573 1124.2292 1136.1229 1143.2717 1153.4041 1155.4203 1185.4470 1199.7736 1210.9016 1230.2486 1250.0447 1267.3959 1273.3006 1280.7663 1283.9366 1285.8147 1300.9465 1332.5562 1341.7578 1348.5459 1351.5794 1366.6222 1369.8019 1386.9402 1389.7007 1394.4917 1408.3256 1411.7383 1454.5000 1456.2877 1458.9287 1461.0934 1462.0909 1463.7920 1468.6739 1470.8294 1474.6197 1481.3176 1485.6788 1488.4213 1497.2936 1641.2485 2827.5223 2844.3420 2860.5102 2897.7949 2915.1417 2944.7034 2958.5853 2978.3373 2981.0370 2989.1668 2993.6554 2995.9407 3009.2418 3026.6810 3032.2624 3056.9158 3075.7839 3083.2418 3089.3344 3091.3211 3095.5920 3100.3663 3114.9873 3119.0828
redmass: 3.8538 2.2393 2.5425 4.0277 2.5316 3.7180 3.2649 2.0852 5.8085 3.1224 3.3449 2.5435 4.3417 2.3663 1.4170 1.1723 1.8379 2.6190 2.6102 3.0494 4.7087 2.2070 3.0445 3.0251 2.9982 3.1939 4.3289 3.7841 2.2489 11.1688 3.2323 3.2166 1.1238 1.3224 1.0860 3.0498 1.5826 2.8931 1.2330 2.2790 2.6520 3.2365 2.7980 2.9727 1.9184 2.9882 3.3948 2.5142 4.0452 2.1709 2.1221 2.1553 1.9865 2.0156 2.1121 1.6672 2.3399 1.3521 1.0992 2.1748 1.7611 1.1459 1.3316 1.4174 1.2888 1.1830 1.1503 1.3819 1.2797 1.2523 1.3213 1.2541 1.4101 1.3511 1.2379 1.2418 1.4712 1.4770 2.4471 1.0825 1.1077 1.0410 1.0794 1.0502 1.0975 1.0999 1.0795 1.0840 1.0620 1.0536 1.0839 1.0832 9.0712 1.0710 1.0713 1.0694 1.0546 1.0548 1.1053 1.1066 1.0684 1.0685 1.0360 1.0358 1.0848 1.0612 1.0591 1.0892 1.0885 1.1035 1.0981 1.1028 1.0991 1.0952 1.1009 1.1055 1.0932
irintensity: 0.2111 1.9620 1.4388 0.7409 0.1763 4.5302 2.2612 0.2492 0.4056 0.4790 5.8783 0.7740 1.8216 2.1385 2.8643 0.7352 1.9750 4.8406 3.7632 12.9378 16.0834 1.7438 2.2053 8.6119 0.8213 2.4587 7.9899 5.0021 1.7474 17.3158 13.8355 8.7796 5.8553 3.2980 4.6595 8.0091 0.9407 4.4806 1.2367 13.7180 5.0980 88.6721 35.0338 41.4795 37.2508 126.6991 42.0595 9.3825 100.2979 69.3357 21.7575 49.6570 9.6799 21.2410 31.3389 43.7730 26.4232 1.9270 9.7368 114.2349 167.5110 0.4752 10.6617 30.9131 9.8992 3.2199 1.5576 25.2056 10.8197 17.6876 36.6641 11.2271 3.2222 8.9812 30.9235 23.4742 17.6304 4.0011 115.9111 11.9733 46.1996 11.0134 21.3185 19.4864 4.2478 9.3068 1.4560 7.4710 8.1177 18.0593 0.7467 6.8806 435.3009 56.7263 53.8475 147.4003 39.5846 116.2997 66.8364 58.5810 14.4614 81.1748 20.7404 26.2276 15.9818 29.1072 42.9623 51.9842 38.9743 40.5349 38.8213 6.3933 37.9323 5.6238 38.7128 34.2230 4.8079
temp: 298.150 k
press: 1.00000 atm
elementType: 8 8 8 7 7 6 6 6 6 6 6 6 6 6 6 6 6 1 1 1 1 1 1 1 1 1 1 1 1 1 1 1 1 1 1 1 1 1 1 1 1
symmnumber: 1
zpe: 934998.5 jmol-1
zpe.correction: 0.356122 hartree
zpe.thermalcorrener: 0.375946 hartree
zpe.thermalcorrenthalpy: 0.376890 hartree
zpe.thermalcorrgfe: 0.304739 hartree
zpe.sumelectzpe: -805.438630 hartree
zpe.sumelectthermal: -805.418806 hartree
zpe.sumelectthermalent: -805.417862 hartree
zpe.sumelectthermalfe: -805.490014 hartree
dipole: -2.5171 -0.6849 1.3927
dipole: 2.9571
quadrupole: -101.5316 -102.7703 -104.4259
quadrupole: -15.5710 -6.9779 -0.3086
quadrupole: 1.3777 0.1390 -1.5166 -15.5710 -6.9779 -0.3086
hfenergy: -805.7947523 hartree
pointgroup: C01 [X(C12H24N2O3)]
dipole: -0.9901026 -0.2955455 0.5346734 debye
polarizability: 211.9144904|-3.1215003|141.6327767|4.6551264|4.1872447|121.7787693 unknown
InChI: InChI=1S/C12H24N2O3/c1-3-16-11-5-6-13-7-9-14(10-8-13)12(15)17-4-2/h3-11H2,1-2H3
charge 0 multiplicity 1
41 atoms
O  -5.259369 -0.616654 -0.202789
O  4.01026 -1.096102 -0.565065
O  4.453165 1.110012 0.135015
N  -0.511416 0.762059 -0.141797
N  2.311444 0.460368 -0.57389
C  0.455565 1.718093 0.459309
C  0.095305 -0.590328 -0.242746
C  1.733597 1.805852 -0.394313
C  1.375477 -0.551395 -1.100795
C  -1.805995 0.768508 0.584856
C  -2.920093 -0.00557 -0.149652
C  -4.291284 0.238266 0.490481
C  3.643844 0.2419 -0.29812
C  -6.624734 -0.459865 0.318496
C  5.425257 -1.435602 -0.248253
C  -7.53308 -1.395037 -0.479372
C  5.590302 -1.796706 1.231037
H  -0.017384 2.716808 0.504179
H  0.735057 1.421696 1.503111
H  0.343996 -1.000334 0.770823
H  -0.624677 -1.276971 -0.720285
H  2.491164 2.445556 0.085821
H  1.479544 2.230805 -1.386301
H  1.0998 -0.284568 -2.141355
H  1.87176 -1.532132 -1.103955
H  -1.694067 0.362704 1.625671
H  -2.114228 1.828462 0.686947
H  -2.946296 0.312197 -1.207729
H  -2.731021 -1.094748 -0.134623
H  -4.270977 -0.011972 1.577298
H  -4.58709 1.308551 0.393043
H  -6.645268 -0.712885 1.40301
H  -6.949851 0.599811 0.2103
H  6.063271 -0.576594 -0.520563
H  5.638805 -2.292007 -0.908882
H  -7.505139 -1.135624 -1.551727
H  -8.57719 -1.317827 -0.124925
H  -7.200212 -2.4415 -0.3690
H  4.90911 -2.617773 1.515494
H  5.383226 -0.919671 1.866849
H  6.628717 -2.126281 1.423297
