program: Gaussian 09
title: 000232670
version: EM64L-G09RevD.01
frameworkgroup: C1[X(C12H14ClNO2S4)]
method: RPBEPBE
basis: SDD
operation: Freq
keyword: #p
keyword: freq=noraman
keyword: PBEPBE/SDD
title: #p freq=noraman PBEPBE/SDD
converged: YES YES NO NO
title: Mulliken charges:
elementType: Cl S S S S O O N C C C C C C C C C C C C H H H H H H H H H H H H H H
charge: -0.059082 0.180455 0.187547 0.051824 0.053344 -0.146304 -0.147680 -0.008728 0.468123 -0.741111 -0.709726 -0.307996 -0.320789 -0.224809 -0.223648 -0.117892 -0.342424 -0.360827 -0.513883 -0.515402 0.319694 0.306729 0.314880 0.330483 0.264219 0.246553 0.260486 0.254553 0.247702 0.250929 0.253757 0.249481 0.251851 0.247689
chargesum: 0.00000
title: Mulliken charges with hydrogens summed into heavy atoms:
elementType: Cl S S S S O O N C C C C C C C C C C C C
charge: -0.059082 0.180455 0.187547 0.051824 0.053344 -0.146304 -0.147680 -0.008728 0.468123 -0.114687 -0.064362 -0.043777 -0.074236 0.035677 0.030904 -0.117892 -0.342424 -0.360827 0.238504 0.233620
polarizability: 2.89288505e+02 1.30162963e+00 2.86103305e+02 -4.45885732e+00 -1.09718084e+01 1.59056885e+02
1716.lowfreq: -7.4167 -3.6160 -1.7648 0.0003 0.0025 0.0030 16.9801 21.4305 24.3088
frequency: 16.7504 21.2953 24.2796 35.7164 44.8531 51.6205 54.6686 67.6020 99.0667 127.2163 127.7805 131.5903 146.3050 159.6542 184.1734 187.4332 198.2401 238.0453 265.6545 285.6776 320.2902 328.1687 335.9028 343.3438 377.7653 412.4891 438.3154 443.3410 477.1463 484.8056 494.2640 499.9733 502.4937 505.3099 516.8858 545.2803 596.8076 624.6707 639.6785 703.4480 756.0086 806.3034 824.0138 856.8322 858.8433 908.5870 929.6411 935.0386 955.1293 962.0656 967.9213 988.5742 1041.0509 1083.7192 1092.1415 1092.5152 1128.6963 1141.7350 1142.7353 1161.1363 1171.3111 1179.6227 1205.2074 1210.3261 1272.9320 1277.3988 1288.2124 1312.6363 1378.1512 1381.3411 1413.2613 1426.2784 1427.1635 1454.7809 1455.1826 1456.4705 1457.1347 1457.8611 1480.9641 1491.0940 1583.9155 1607.9603 2996.1043 2997.7657 3005.3329 3009.7059 3101.7686 3104.4828 3114.8370 3125.0921 3143.6383 3150.1412 3150.7136 3151.5362 3171.2082 3174.2224
redmass: 6.5086 5.5384 7.1296 11.7658 11.9828 5.7884 7.1260 6.4074 9.5076 2.9645 2.8621 10.1794 5.6381 7.2697 1.2490 1.2538 5.2594 4.3343 5.1695 5.0147 8.9520 10.9709 7.0269 5.4074 4.7916 3.0061 5.5313 5.2546 2.7570 4.6131 9.0059 12.2686 12.0386 11.9846 2.9336 8.7483 4.2946 7.1608 6.8767 3.4700 5.4557 1.3139 1.5497 8.2624 8.4224 1.6213 2.1196 1.3342 1.4222 5.1684 4.8448 4.4500 2.5863 2.4114 1.2473 1.2466 1.4837 1.3957 1.4159 2.6820 4.2874 3.1355 1.2111 1.5950 1.2778 1.2330 1.4297 1.4219 4.5009 2.5655 2.6573 1.1681 1.1727 1.0487 1.0489 1.1481 1.0539 1.0508 1.1423 2.2719 7.5081 6.0587 1.0298 1.0296 1.0630 1.0652 1.1055 1.1056 1.1076 1.1040 1.0907 1.0881 1.1034 1.1036 1.0956 1.0968
irintensity: 2.2352 2.1075 0.3946 2.1927 0.8042 0.5068 2.7340 0.3480 0.8849 5.7708 4.2369 4.9651 1.8716 3.5143 0.5550 1.5018 7.6497 4.1992 1.2519 2.1707 24.3927 4.6300 23.7836 17.1071 45.2290 0.2341 19.5366 19.3946 11.4402 232.7967 10.2230 31.5417 4.5909 4.3884 27.2554 96.7321 14.6640 18.4225 43.7086 1.9145 26.2651 20.9895 54.0936 135.5761 104.8757 66.9487 208.4231 2.5098 11.2034 202.1278 161.2587 14.7423 26.8077 22.8867 0.0171 0.0079 15.2536 52.3135 13.7808 206.5620 23.4510 611.0025 3.6502 122.8879 200.4545 71.4858 25.5895 14.4041 35.2643 41.0904 14.3293 21.4509 20.0280 83.3431 22.1214 17.7331 24.8507 18.3212 11.7216 255.1626 1.1776 27.0427 20.6389 18.4214 7.0890 22.9253 18.8474 19.1920 28.7707 9.7349 5.3389 13.2571 22.8686 20.1602 3.8011 3.0196
temp: 298.150 k
press: 1.00000 atm
elementType: 17 16 16 16 16 8 8 7 6 6 6 6 6 6 6 6 6 6 6 6 1 1 1 1 1 1 1 1 1 1 1 1 1 1
symmnumber: 1
zpe: 630889.2 jmol-1
zpe.correction: 0.240293 hartree
zpe.thermalcorrener: 0.263287 hartree
zpe.thermalcorrenthalpy: 0.264231 hartree
zpe.thermalcorrgfe: 0.182981 hartree
zpe.sumelectzpe: -2721.632486 hartree
zpe.sumelectthermal: -2721.609492 hartree
zpe.sumelectthermalent: -2721.608548 hartree
zpe.sumelectthermalfe: -2721.689799 hartree
dipole: 2.4441 -1.8102 -3.2390
dipole: 4.4432
quadrupole: -160.6224 -149.4119 -153.9780
quadrupole: -27.0700 12.0634 -13.9272
quadrupole: -5.9517 5.2589 0.6927 -27.0700 12.0634 -13.9272
hfenergy: -2721.8727792 hartree
pointgroup: C01 [X(C12H14Cl1N1O2S4)]
dipole: -0.9941381 -0.4934068 -1.3505683 debye
polarizability: 286.1791122|-0.0098267|289.1620059|0.1640731|12.1967276|159.1075764 unknown
InChI: InChI=1S/C12H14ClNO2S4/c1-15-11(17)19-7-14(8-20-12(18)16-2)10-5-3-9(13)4-6-10/h3-6H,7-8H2,1-2H3
charge 0 multiplicity 1
34 atoms
Cl -1.89792 5.494121 0.147997
S  -2.55727 -2.030254 -0.44107
S  2.577736 -0.648502 -0.574516
S  -0.418825 -4.362756 -0.387415
S  3.232815 0.4769 2.298894
O  -2.906948 -4.558436 0.486553
O  4.955458 0.332257 0.295066
N  -0.239791 -0.334032 -0.34865
C  -0.629803 1.036542 -0.22683
C  -0.945561 -1.218121 -1.22412
C  0.869272 -0.865357 0.388455
C  0.226811 1.981626 0.401853
C  -1.886088 1.478365 -0.728171
C  -0.159509 3.332246 0.519637
C  -2.270748 2.83089 -0.618716
C  -1.401395 3.745403 0.00267
C  -1.958688 -3.743459 -0.081667
C  3.666626 0.091996 0.713429
C  -4.284373 -4.075775 0.780878
C  5.400899 0.007469 -1.087415
H  -0.338166 -2.099493 -1.492869
H  -1.336914 -0.709861 -2.115931
H  1.053194 -0.374254 1.359472
H  0.777746 -1.955034 0.500984
H  1.199669 1.6852 0.805647
H  -2.593399 0.777769 -1.181578
H  0.508034 4.050384 1.004314
H  -3.240928 3.15933 -1.002336
H  -4.79414 -3.778543 -0.151633
H  -4.251791 -3.229934 1.488939
H  -4.776759 -4.946353 1.234683
H  5.2993 -1.074611 -1.279524
H  6.45694 0.309103 -1.101864
H  4.818117 0.585174 -1.825568
