program: Gaussian 09
title: 000232641
version: EM64L-G09RevD.01
frameworkgroup: C1[X(C13H8N2O3)]
method: RPBEPBE
basis: SDD
operation: Freq
keyword: #p
keyword: freq=noraman
keyword: PBEPBE/SDD
title: #p freq=noraman PBEPBE/SDD
converged: NO YES NO YES
title: Mulliken charges:
elementType: O O O N N C C C C C C C C C C C C C H H H H H H H H
charge: -0.243683 -0.197206 -0.266497 -0.464144 0.022314 0.108564 0.236878 0.247643 0.183975 0.055450 0.275014 -0.373246 -0.375858 -0.347484 -0.373607 -0.228601 -0.204645 -0.255151 0.365249 0.289890 0.249031 0.281281 0.290465 0.247570 0.237323 0.239472
chargesum: 0.00000
title: Mulliken charges with hydrogens summed into heavy atoms:
elementType: O O O N N C C C C C C C C C C C C C
charge: -0.243683 -0.197206 -0.266497 -0.098894 0.022314 0.108564 0.236878 0.247643 0.183975 0.055450 0.275014 -0.083355 -0.126826 -0.066204 -0.083142 0.018969 0.032679 -0.015679
polarizability: 2.95460093e+02 -5.62626917e+00 2.04923247e+02 1.45828870e-02 1.95214126e-02 6.09515887e+01
1716.lowfreq: -5.4832 -4.7456 -0.0010 -0.0009 -0.0006 5.2874 61.1445 63.5920 102.5305
frequency: 61.1410 63.5906 102.5299 144.2095 160.4091 190.3239 251.1030 286.5265 307.8856 321.3360 343.0450 357.0517 415.3564 448.6418 473.2649 500.4617 521.9691 548.6126 554.2687 601.3010 636.3007 654.7154 670.6747 698.5207 711.7592 719.9899 771.9598 791.4034 809.0450 832.5467 860.5028 864.7488 887.8885 890.1882 950.0703 974.1537 976.6450 1003.4860 1007.8976 1030.8113 1075.2473 1106.6422 1131.4255 1163.5897 1173.4839 1181.1076 1192.4980 1258.6656 1267.2943 1293.8939 1305.0797 1338.6587 1388.5841 1402.2114 1425.4350 1445.3268 1469.6675 1483.2005 1517.3009 1543.9720 1584.2357 1585.6763 1618.9313 1628.7808 3133.1640 3146.9409 3150.9622 3158.2507 3168.7562 3173.9718 3187.0603 3296.3374
redmass: 8.4215 7.4260 6.7586 5.9058 7.6010 4.9238 5.2462 6.6758 5.3433 10.0567 10.3411 6.8914 3.8122 8.3431 4.5836 9.7349 3.5158 7.7909 3.4099 6.6724 6.8871 6.4875 6.6663 5.6965 9.2016 3.5829 1.4523 1.8467 7.6938 2.0099 1.2254 6.1421 5.4249 1.4920 6.5900 1.3551 1.3793 1.3380 1.3714 2.0859 1.7634 2.0222 4.2846 2.2528 1.1230 1.6329 1.9514 2.5623 1.7882 2.5664 3.4534 3.6358 3.8126 9.7942 3.2823 2.6762 2.9295 3.2243 3.8324 10.4449 4.1980 7.4019 5.9176 7.4677 1.0875 1.0892 1.0890 1.0944 1.0920 1.1005 1.0974 1.0796
irintensity: 0.0000 8.8374 0.1023 0.3470 4.3200 0.2434 0.0617 10.0557 0.1201 5.1863 2.1337 0.8161 1.4263 4.5681 0.2229 4.7575 0.1024 0.6222 15.5557 0.5137 5.8058 21.2832 0.9102 0.1384 5.3410 16.6824 70.6618 21.0816 4.0611 9.2535 104.5639 0.4057 0.6825 19.7873 29.0275 3.2201 1.7118 0.0199 2.4864 2.2559 27.3123 13.2343 114.6115 113.5877 31.4546 88.1027 69.6373 28.3914 0.2387 115.7137 104.7619 114.4275 1.0330 91.2743 52.5600 3.3765 163.1140 6.7126 111.8771 136.5923 62.1730 140.5624 238.6073 43.5607 2.3440 6.0869 0.4305 5.0784 10.4659 25.7548 4.0679 109.6312
temp: 298.150 k
press: 1.00000 atm
elementType: 8 8 8 7 7 6 6 6 6 6 6 6 6 6 6 6 6 6 1 1 1 1 1 1 1 1
symmnumber: 1
zpe: 486836.4 jmol-1
zpe.correction: 0.185426 hartree
zpe.thermalcorrener: 0.198455 hartree
zpe.thermalcorrenthalpy: 0.199399 hartree
zpe.thermalcorrgfe: 0.145630 hartree
zpe.sumelectzpe: -834.093386 hartree
zpe.sumelectthermal: -834.080358 hartree
zpe.sumelectthermalent: -834.079413 hartree
zpe.sumelectthermalfe: -834.133182 hartree
dipole: 1.6507 -0.2932 -0.0003
dipole: 1.6765
quadrupole: -97.8104 -107.6978 -105.3586
quadrupole: -23.9662 -0.0016 -0.0017
quadrupole: 5.8118 -4.0755 -1.7363 -23.9662 -0.0016 -0.0017
hfenergy: -834.2788125 hartree
pointgroup: C01 [X(C13H8N2O3)]
dipole: 0.6533158 -0.0906942 -0.0001194 debye
dipolederiv: -0.595013 -0.1985784 -0.000041 -0.2507679 -1.0996383 -0.0001078 -0.000076 -0.0001698 -0.3374636 -1.3046901 -0.3407491 -0.00001 -0.2625979 -0.4689239 -0.0000371 0.0000163 -0.0000203 -0.2225943 -0.3262683 0.2848295 0.0000836 -0.1420722 -0.8466062 -0.0001215 0.0000106 -0.0001046 -0.268522 -1.4492499 0.1367286 -0.0000472 0.4931772 -0.4333301 0.0000228 -0.0000688 -0.0000147 -0.2398034 1.5102371 0.3480851 -0.0000531 1.0000308 1.6250207 0.0002541 0.0000405 0.0001832 0.1964071 0.7340883 -0.1488299 0.0000082 -0.9250416 0.4743321 -0.0000148 -0.0001243 0.0000356 0.1146559 -0.6402674 -0.2542488 -0.0000828 0.617509 -0.2497301 0.0000065 0.0000887 -0.0000562 -0.0240877 1.2002634 0.0461595 0.000088 -0.0435607 0.1358716 -0.0000118 0.0001046 0.0000225 0.1098784 -0.2276226 0.4127776 0.0000419 0.0315794 -0.4686004 -0.000064 -0.0000201 -0.0000227 -0.0298167 1.1382656 0.0428654 0.0000864 0.1230332 1.2439489 0.0001592 0.0001153 0.0001895 0.1419937 -0.4292417 0.0246594 0.0000028 -0.7864721 -0.8027643 -0.0001532 -0.0001088 -0.0000902 0.0172888 0.6927492 0.3218673 0.0000836 -0.3157936 0.0798815 -0.0000008 -0.0000058 0.0000373 -0.0585298 -0.4974565 0.0093429 -0.00002 0.2087417 0.0748763 0.0000595 0.0000024 0.0000435 -0.1891776 -0.0520988 -0.2256967 -0.0000233 0.2041758 0.1249255 0.0000456 0.0000274 0.0000093 -0.0906312 -0.1095141 -0.1911316 -0.0000243 0.5435858 0.5451071 0.0001156 0.0000998 0.0001094 -0.0775671 -0.5078507 -0.4480623 -0.0000838 -0.5316179 -0.2766955 -0.0000342 -0.0000838 -0.0000174 -0.1738915 0.2463272 0.0553326 0.0000376 0.0056971 0.224299 0.0000501 0.0000368 0.0000538 -0.1176 0.0805657 0.112207 0.0000454 -0.0909785 -0.3173196 -0.0000237 0.0000139 -0.0000063 -0.173916 0.296973 0.0124686 -0.000015 0.1304959 0.2330645 -0.000007 0.0000148 -0.0000161 0.3031213 0.1374933 -0.0707366 -0.0000099 -0.0010365 0.0417657 -0.0000144 -0.0000052 -0.0000245 0.1469463 0.0504141 -0.0976802 -0.0000278 -0.0420548 -0.0337245 -0.0000359 -0.0000104 -0.0000406 0.1714657 0.110243 -0.0005272 -0.000005 -0.0815403 0.0192774 -0.0000261 -0.0000196 -0.0000211 0.1524984 0.0636166 0.0045763 -0.0000073 -0.0608227 0.1254673 -0.0000089 -0.000016 -0.0000186 0.1645425 -0.0048655 0.0834714 0.0000028 0.0844762 -0.0082885 -0.0000204 -0.0000028 -0.0000274 0.1639411 0.0039946 0.0971852 0.0000006 0.1170317 -0.0257447 -0.000017 0.0000012 -0.0000184 0.1551709 -0.1210924 -0.0163155 -0.0000303 -0.025177 0.0835284 -0.0000148 -0.0000308 -0.0000151 0.1656909 unknown
polarizability: 295.7559505|-2.1866283|204.6273893|0.0138337|0.0200593|60.9515887 unknown
InChI: InChI=1S/C13H8N2O3/c16-13-8-4-1-2-6-10(8)14-12-9(13)5-3-7-11(12)15(17)18/h1-7,14H
charge 0 multiplicity 1
26 atoms
O  1.463108 2.867208 0.000351
O  -4.103842 -1.793829 -0.000474
O  -1.996185 -2.651816 -0.00079
N  0.074909 -1.051007 -0.000428
N  -2.825381 -1.631687 -0.000543
C  -0.852946 -0.030947 -0.000344
C  -0.407449 1.33573 -0.000098
C  1.45731 -0.831682 -0.000255
C  1.97049 0.501326 -0.000008
C  1.047994 1.6606 0.00004
C  -2.27373 -0.276867 -0.000444
C  -1.352268 2.385282 0.000002
C  2.344455 -1.942098 -0.000342
C  3.376689 0.698622 0.000164
C  -3.195846 0.794227 -0.000321
C  -2.738678 2.125044 -0.000111
C  3.731117 -1.720104 -0.000166
C  4.254386 -0.396793 0.00009
H  -0.327062 -2.005962 -0.000691
H  -0.957429 3.407092 0.000174
H  1.942348 -2.961462 -0.000541
H  3.740964 1.731114 0.000348
H  -4.262253 0.553415 -0.000386
H  -3.457917 2.948632 -0.000021
H  4.413977 -2.576467 -0.000229
H  5.337238 -0.238173 0.000222
