program: Gaussian 09
title: 000232635
version: EM64L-G09RevD.01
frameworkgroup: C1[X(C8H9BrO2S)]
method: RPBEPBE
basis: SDD
operation: Freq
keyword: #p
keyword: freq=noraman
keyword: PBEPBE/SDD
title: #p freq=noraman PBEPBE/SDD
converged: NO NO NO NO
title: Mulliken charges:
elementType: Br S O O C C C C C C C C H H H H H H H H H
charge: 0.107948 0.939769 -0.527018 -0.527366 -0.091885 -0.251128 -0.251361 0.447966 -0.360550 -0.359957 -0.734168 -0.797361 0.288482 0.288459 0.246851 0.246793 0.312802 0.312991 0.230893 0.230869 0.246970
chargesum: 0.00000
title: Mulliken charges with hydrogens summed into heavy atoms:
elementType: Br S O O C C C C C C C C
charge: 0.107948 0.939769 -0.527018 -0.527366 -0.091885 0.037354 0.037098 0.447966 -0.113699 -0.113164 -0.108375 -0.088628
polarizability: 2.09598490e+02 -1.20894671e+00 1.15710198e+02 -1.08654325e+01 -3.84673520e+00 8.34336800e+01
1716.lowfreq: -10.4413 -6.9111 -2.1195 -0.0017 0.0013 0.0013 8.1570 12.8074 42.6286
frequency: 6.4421 11.2551 42.6253 46.8143 114.7789 125.1392 135.6628 205.7183 217.7897 290.6630 292.9600 336.7519 374.8083 407.5919 436.3803 470.9538 533.8529 582.4302 621.0572 632.2994 705.5555 775.8707 784.6640 804.0469 830.2921 852.9053 940.4880 963.8570 982.5579 990.6975 993.2116 1049.3708 1051.2449 1088.9480 1118.7497 1171.3539 1183.4936 1217.9252 1295.5183 1343.9623 1381.9472 1389.4292 1399.8513 1470.9573 1472.4020 1474.6841 1593.1430 1595.8449 2982.6395 3065.5047 3066.8142 3094.1024 3136.7398 3137.6813 3156.4572 3159.9725 3188.8502
redmass: 1.0935 3.5825 6.9238 4.0239 8.4965 6.1471 6.7989 4.2300 8.3524 5.7113 4.2452 7.2028 3.2904 2.8742 12.7333 3.7543 4.9456 5.9352 6.9485 6.4602 3.3799 5.0428 1.5534 10.2544 1.3983 1.2408 5.7679 1.2931 1.3931 1.3932 5.5617 1.6098 2.4291 1.0920 1.2853 1.1194 1.1485 2.9826 1.2659 1.0787 6.1583 2.9724 1.2185 1.1014 2.3474 1.0623 5.9712 6.9666 1.0390 1.0948 1.0506 1.1001 1.0883 1.0886 1.0961 1.0975 1.1171
irintensity: 0.4167 1.0245 0.3615 2.0717 2.2381 1.1740 1.1725 0.0064 9.2097 6.9093 0.8956 9.4550 0.0131 0.0027 93.8138 2.6548 70.2159 39.3642 0.2429 14.2246 1.0658 4.1107 0.4493 94.0292 26.6742 0.7806 87.6104 1.0159 0.4004 2.1971 1.7062 27.7950 24.7830 2.0405 6.7473 40.7659 8.7628 7.2149 2.7717 1.1597 0.1190 10.8313 16.7605 17.7915 20.4347 14.0819 12.2540 0.1459 21.7072 18.0847 6.9480 14.4724 12.2111 3.8428 1.6912 14.3106 0.0063
temp: 298.150 k
press: 1.00000 atm
elementType: 35 16 8 8 6 6 6 6 6 6 6 6 1 1 1 1 1 1 1 1 1
symmnumber: 1
zpe: 393557.7 jmol-1
zpe.correction: 0.149898 hartree
zpe.thermalcorrener: 0.163401 hartree
zpe.thermalcorrenthalpy: 0.164345 hartree
zpe.thermalcorrgfe: 0.104039 hartree
zpe.sumelectzpe: -871.150062 hartree
zpe.sumelectthermal: -871.136559 hartree
zpe.sumelectthermalent: -871.135615 hartree
zpe.sumelectthermalfe: -871.195922 hartree
dipole: 5.7055 -0.6217 -5.1634
dipole: 7.7201
quadrupole: -71.7854 -87.5112 -96.7267
quadrupole: 0.2512 2.2209 -1.1424
quadrupole: 13.5557 -2.1701 -11.3856 0.2512 2.2209 -1.1424
hfenergy: -871.2999603 hartree
pointgroup: C01 [X(C8H9Br1O2S1)]
dipole: -2.4756824 -0.0123835 1.7595829 debye
dipolederiv: -0.5770836 0.0028534 -0.1927744 0.003315 -0.0087768 0.0014198 -0.122964 0.0007125 -0.0510087 1.5948319 0.0020808 -0.136636 0.0011911 1.126615 -0.0013298 0.2201329 -0.0031132 1.3959809 -0.6505407 0.0272285 0.0336763 0.0187971 -0.6019433 -0.1820948 -0.051374 -0.0244278 -0.5675043 -0.6511798 -0.0283497 0.0329483 -0.0189847 -0.6058041 0.1817159 -0.052411 0.024084 -0.5646162 -0.1498417 -0.0000795 0.0049824 0.0007154 -0.1327102 0.0009878 -0.1225908 0.0012795 -0.2818964 -0.1586045 0.0959035 -0.0189378 -0.2668864 -0.0210587 0.0151139 -0.015053 -0.0486484 -0.0890203 -0.1590977 -0.0958109 -0.0199362 0.2658475 -0.0214199 -0.0144966 -0.0119906 0.0495549 -0.088528 0.5792816 0.001241 -0.052914 0.0001778 0.0091891 0.0000807 0.0044907 0.0001633 -0.0155389 -0.2273053 -0.1297719 -0.0010224 -0.1272159 0.0662237 0.0073425 0.0088104 0.0105249 -0.1348539 -0.2281569 0.129017 0.0004535 0.1264809 0.0670608 -0.0049406 0.0104052 -0.007983 -0.135181 0.7882737 -0.0051599 0.2993697 -0.0056635 -0.0983357 -0.0016074 0.2223257 -0.0001586 -0.1408588 -0.2455138 -0.0004817 0.0138666 -0.0005833 0.0777745 0.0002381 -0.1168182 -0.000006 0.0605299 0.1234929 -0.0687113 0.0144384 -0.0452437 0.0633235 -0.0012297 0.0055316 0.0174683 0.1441331 0.1227432 0.0686746 0.0151823 0.0457562 0.063687 0.0003025 0.0061176 -0.0184959 0.143944 -0.0173454 0.0872891 0.0220867 0.0852658 -0.0310712 -0.0081779 0.0357437 -0.0155973 0.1493711 -0.0168722 -0.0873311 0.0209446 -0.0854021 -0.0316249 0.0060284 0.0345927 0.013287 0.1494977 -0.0868644 -0.0635744 -0.0115195 -0.0499406 0.036508 0.023936 -0.0663392 0.0325705 -0.0111037 -0.0853555 0.0651022 -0.0111037 0.0519106 0.0361906 -0.0230071 -0.0673051 -0.0311322 -0.0113899 0.0422749 -0.0071929 0.0225332 -0.0814289 -0.0570137 0.1095205 0.084675 0.0777673 0.0548719 0.0422961 0.0071453 0.0226503 0.081553 -0.0554678 -0.1103345 0.0854307 -0.0784111 0.0534813 -0.039433 -0.0000721 -0.0582883 0.0003387 0.1186543 0.0005321 -0.0914105 0.0005612 -0.0603098 unknown
polarizability: 210.3712602|-0.1799729|116.1617856|4.5865498|0.1598717|82.2093222 unknown
InChI: InChI=1S/C8H9BrO2S/c1-7-2-4-8(5-3-7)12(10,11)6-9/h2-5H,6H2,1H3
charge 0 multiplicity 1
21 atoms
Br 4.476874 -0.016375 1.317475
S  1.800955 0.007252 -0.558218
O  2.18839 -1.419403 -1.248461
O  2.185477 1.444483 -1.22808
C  -0.067148 0.003023 -0.210034
C  -0.72468 1.239008 -0.111494
C  -0.722044 -1.235492 -0.126482
C  -2.831587 -0.002545 0.222433
C  -2.119717 1.222174 0.112368
C  -2.117074 -1.224344 0.097578
C  2.515623 -0.004291 1.294012
C  -4.334864 -0.00544 0.427309
H  -0.170923 2.176127 -0.233892
H  -0.166395 -2.169924 -0.26031
H  -2.66181 2.170926 0.194747
H  -2.65717 -2.17517 0.168468
H  2.123931 -0.928076 1.741464
H  2.13508 0.921156 1.747583
H  -4.669494 -0.901341 0.97794
H  -4.672065 0.885494 0.984365
H  -4.86186 -0.002743 -0.546271
