program: Gaussian 09
title: 000232648
version: EM64L-G09RevD.01
frameworkgroup: C1[X(C13H30N4O)]
method: RPBEPBE
basis: SDD
operation: Freq
keyword: #p
keyword: freq=noraman
keyword: PBEPBE/SDD
title: #p freq=noraman PBEPBE/SDD
converged: YES YES NO NO
title: Mulliken charges:
elementType: O N N N N C C C C C C C C C C C C C H H H H H H H H H H H H H H H H H H H H H H H H H H H H H H
charge: -0.320876 -0.107124 -0.091518 -0.401917 -0.398550 -0.332672 -0.353634 -0.403468 -0.397182 -0.338632 -0.324113 -0.324740 -0.326582 0.304296 -0.672291 -0.674330 -0.676507 -0.703481 0.225235 0.189895 0.193822 0.243496 0.249711 0.229583 0.268651 0.216574 0.187811 0.237032 0.185714 0.205546 0.178049 0.201800 0.179846 0.200687 0.276892 0.276733 0.203367 0.225811 0.207416 0.204065 0.228040 0.205577 0.211171 0.225128 0.204952 0.268472 0.212803 0.199440
chargesum: 0.00000
title: Mulliken charges with hydrogens summed into heavy atoms:
elementType: O N N N N C C C C C C C C C C C C C
charge: -0.320876 -0.107124 -0.091518 -0.125025 -0.121817 0.082458 0.083684 0.075827 0.088043 0.086211 0.067146 0.055110 0.053951 0.304296 -0.035696 -0.036648 -0.035256 -0.022766
polarizability: 2.21316496e+02 3.76115182e-01 1.73284257e+02 -1.34505442e+00 -4.93710109e+00 1.42744069e+02
1716.lowfreq: -10.0981 -0.0012 0.0002 0.0003 4.1480 5.9668 16.7736 19.4526 22.6283
frequency: 13.0964 17.7648 22.3220 35.6994 45.3542 60.5408 67.6865 72.3400 78.9246 88.3230 95.1818 114.3253 155.6670 179.5535 200.7886 224.4107 227.9114 233.3449 247.7457 262.8073 268.7836 285.8467 291.6508 303.4656 315.0145 326.4950 381.5905 387.9052 399.6504 440.8924 456.6233 471.1978 476.4767 509.3387 584.3705 648.0110 711.6726 743.0579 753.5823 757.1289 782.9231 796.1663 799.0819 801.5517 808.3003 896.6270 915.7382 926.0366 986.5274 989.4533 1013.9730 1038.2049 1054.2448 1062.4028 1070.7472 1074.2738 1074.9556 1078.3083 1082.2175 1085.2637 1090.5755 1123.0583 1125.4298 1155.4070 1165.9097 1186.2300 1207.2300 1210.3000 1232.7202 1252.6319 1261.2317 1280.4707 1284.0828 1290.5191 1292.1660 1305.5855 1310.9852 1326.5391 1330.5961 1358.5951 1363.8774 1364.1873 1375.0921 1380.9676 1382.2010 1384.1847 1387.2676 1388.2256 1396.4181 1434.6804 1444.1709 1456.8117 1461.4550 1464.1470 1465.2495 1465.7301 1472.0399 1473.4650 1476.7680 1480.9451 1481.9418 1484.8756 1489.1018 1491.2735 1493.5342 1503.5370 1506.2602 1616.7197 2833.7925 2843.2272 2849.5340 2864.7216 2901.4868 2952.7854 2978.0650 2979.0951 2980.8290 2983.4785 3007.0661 3017.9928 3021.2739 3024.8606 3026.9756 3031.4490 3031.8733 3033.3941 3070.8991 3073.3163 3074.1056 3076.5054 3084.5241 3089.2616 3089.7768 3090.5243 3090.8156 3095.9767 3555.1321 3563.1171
redmass: 3.3171 3.3788 3.7635 3.3037 3.4817 4.1780 3.6021 2.3309 2.4562 1.9981 2.9065 2.2118 2.0294 1.4465 1.5911 1.1004 1.6507 2.0531 1.3915 1.9164 1.9626 2.2749 1.4551 2.4207 2.4883 3.3213 3.7071 2.5779 2.9095 2.8766 2.5651 1.5728 1.8187 3.0678 3.6906 2.7696 8.2849 1.7059 1.6557 2.4937 1.3683 1.1283 1.1895 1.2315 1.2110 2.4964 1.9363 2.1628 2.4665 2.2915 4.4094 3.5896 2.8830 1.9732 2.0130 2.4917 2.4925 1.9962 2.6824 2.2048 1.6752 1.7531 1.7591 2.2875 1.5188 2.4489 2.2802 2.4047 1.8294 1.4440 1.4386 1.1610 1.2017 1.2019 1.2022 1.1787 1.2627 1.2119 1.3059 1.2981 1.3228 1.3296 1.2926 1.3187 1.2885 1.2450 1.2542 1.2507 1.2224 1.3021 1.0997 1.2348 1.0659 1.0608 1.0528 1.0624 1.0669 1.0553 1.0799 1.0525 1.0653 1.0579 1.0788 1.0659 1.1008 1.0929 2.1199 4.8872 1.0718 1.0709 1.0721 1.0715 1.0690 1.0584 1.0356 1.0357 1.0357 1.0358 1.0971 1.0851 1.0639 1.0701 1.0855 1.0869 1.0880 1.0890 1.0984 1.0981 1.0988 1.0983 1.1009 1.1002 1.1006 1.1005 1.1037 1.1038 1.0781 1.0773
irintensity: 0.7630 0.0275 0.0461 0.8140 2.4367 14.6188 5.4604 1.3731 1.0141 1.6439 0.4695 1.0972 0.7620 2.8289 0.7946 0.1340 1.2772 0.1368 1.0877 0.1494 2.3132 3.8702 2.1811 1.1136 1.7155 18.5247 6.3034 7.8766 2.2989 7.0925 3.6944 113.1025 139.4137 10.1860 1.6381 2.4979 14.3895 8.8375 4.8578 5.1815 5.5501 4.9291 4.2984 6.6491 5.7131 0.6516 0.4659 0.6985 2.1073 2.9425 17.4978 8.0927 11.7026 13.3896 24.4196 25.9356 6.6457 25.8326 12.1580 3.4294 26.7446 16.6865 9.3547 26.2869 2.8110 19.5042 34.9931 38.8923 191.4840 14.3899 86.2523 7.7923 17.8405 5.8790 14.0905 19.4320 7.3922 7.4496 4.8868 6.9688 2.6047 2.3883 2.0561 2.0996 2.5808 26.2313 31.9198 23.1932 13.9788 39.2405 14.0818 8.0379 7.5564 10.8523 5.2644 3.5241 2.4927 5.0805 5.6664 8.2959 5.8730 15.6136 22.7821 10.0005 43.2383 39.5628 519.9880 151.2980 39.9779 194.2731 69.2130 119.9836 89.2083 45.3714 27.3055 35.0089 33.5445 34.9834 6.1937 26.8043 38.6455 50.3338 28.2169 45.1090 14.5941 13.2808 43.9852 76.6139 32.9508 60.5697 29.6475 28.3755 56.3013 46.4944 14.6417 14.9452 11.2569 11.3397
temp: 298.150 k
press: 1.00000 atm
elementType: 8 7 7 7 7 6 6 6 6 6 6 6 6 6 6 6 6 6 1 1 1 1 1 1 1 1 1 1 1 1 1 1 1 1 1 1 1 1 1 1 1 1 1 1 1 1 1 1
symmnumber: 1
zpe: 1124398.7 jmol-1
zpe.correction: 0.428261 hartree
zpe.thermalcorrener: 0.452011 hartree
zpe.thermalcorrenthalpy: 0.452955 hartree
zpe.thermalcorrgfe: 0.371058 hartree
zpe.sumelectzpe: -806.084752 hartree
zpe.sumelectthermal: -806.061002 hartree
zpe.sumelectthermalent: -806.060057 hartree
zpe.sumelectthermalfe: -806.141955 hartree
dipole: 0.0555 -3.5998 2.1402
dipole: 4.1884
quadrupole: -111.5675 -100.4618 -116.9906
quadrupole: 1.7486 -0.2320 2.2506
quadrupole: -1.8942 9.2115 -7.3173 1.7486 -0.2320 2.2506
hfenergy: -806.5130125 hartree
pointgroup: C01 [X(C13H30N4O1)]
dipole: 0.0331749 0.2844247 1.6227529 debye
polarizability: 221.2407089|2.3578099|150.8895955|-1.6171605|14.3115074|165.214518 unknown
InChI: InChI=1S/C13H30N4O/c1-5-16(6-2)11-9-14-13(18)15-10-12-17(7-3)8-4/h14-15H,5-12H2,1-4H3
charge 0 multiplicity 1
48 atoms
O  0.04112 0.656184 -0.785636
N  -4.076244 -0.600771 0.178746
N  4.248137 -0.312553 -0.043745
N  -1.156276 1.727031 0.914959
N  1.205168 1.799733 0.888836
C  -2.895435 -0.098058 0.922638
C  2.991811 0.034065 0.667682
C  -2.453754 1.286038 0.380951
C  2.515573 1.465515 0.303698
C  -3.690768 -1.275863 -1.09358
C  -5.008095 -1.409238 1.006808
C  5.401064 -0.588095 0.851131
C  4.059018 -1.329938 -1.110419
C  0.031159 1.352053 0.283244
C  -4.787868 -1.194321 -2.171942
C  -5.846586 -0.554007 1.976019
C  6.768081 -0.37351 0.17055
C  3.153841 -0.843931 -2.259704
H  -2.026855 -0.795398 0.85477
H  -3.1527 -0.004728 1.994274
H  3.132601 -0.037775 1.766002
H  2.176972 -0.670174 0.403201
H  -2.358062 1.230816 -0.716402
H  -3.226079 2.039858 0.615905
H  2.440119 1.537611 -0.793557
H  3.260322 2.208539 0.641625
H  -3.415699 -2.345574 -0.911517
H  -2.775963 -0.786141 -1.474789
H  -4.465319 -2.206074 1.577523
H  -5.696777 -1.933232 0.318959
H  5.35913 -1.624086 1.278777
H  5.32806 0.108536 1.707751
H  3.639407 -2.279988 -0.68705
H  5.053548 -1.578593 -1.523573
H  -1.13544 2.267939 1.779373
H  1.169318 2.343776 1.750657
H  -5.722923 -1.688563 -1.849962
H  -5.02176 -0.138794 -2.395394
H  -4.451162 -1.687968 -3.102856
H  -5.212177 -0.011215 2.700713
H  -6.433184 0.191839 1.411729
H  -6.542128 -1.191678 2.553503
H  6.938344 -1.087322 -0.654911
H  6.827963 0.648322 -0.243567
H  7.586228 -0.51064 0.902372
H  2.136837 -0.587491 -1.911761
H  3.590455 0.051763 -2.737228
H  3.059076 -1.636399 -3.025899
