program: Gaussian 09
title: 000232620
version: EM64L-G09RevD.01
frameworkgroup: C1[X(C9H11NO2)]
method: RPBEPBE
basis: SDD
operation: Freq
keyword: #p
keyword: freq=noraman
keyword: PBEPBE/SDD
title: #p freq=noraman PBEPBE/SDD
converged: YES YES NO NO
title: Mulliken charges:
elementType: O O N C C C C C C C C C H H H H H H H H H H H
charge: -0.307284 -0.289028 -0.368409 0.477266 -0.520129 -0.440128 -0.366142 -0.215690 -0.221724 -0.240920 0.301221 -0.494786 0.227042 0.264988 0.231449 0.245686 0.324225 0.227199 0.227340 0.229909 0.238887 0.240316 0.228713
chargesum: 0.00000
title: Mulliken charges with hydrogens summed into heavy atoms:
elementType: O O N C C C C C C C C C
charge: -0.307284 -0.289028 -0.044183 0.477266 -0.028100 -0.208679 -0.120455 0.011508 0.005616 -0.011011 0.301221 0.213130
polarizability: 1.51876342e+02 -3.56997114e+00 1.02155842e+02 -8.38581125e+00 3.75968925e+00 6.78772984e+01
1716.lowfreq: -3.8523 -0.0005 -0.0001 0.0003 2.1017 10.5188 23.7559 32.0744 60.1936
frequency: 23.7367 32.0382 60.1897 75.6698 133.8615 175.3971 196.9017 264.8120 274.1506 335.5524 403.6790 449.6481 531.0987 564.5745 603.1453 617.4196 648.3364 699.0159 704.9899 750.7263 800.5726 854.0630 859.4649 915.8515 968.8444 977.7532 990.1055 996.1668 1024.5632 1027.0247 1084.6614 1118.3801 1118.6127 1148.8329 1172.4343 1186.1612 1201.9412 1213.9445 1240.4718 1315.2389 1356.7258 1388.6322 1423.9542 1442.2304 1451.2086 1469.3091 1472.8845 1486.5295 1494.7175 1595.8993 1615.4231 1669.3027 2979.6324 2999.9928 3041.9154 3099.5676 3115.7371 3124.6640 3136.4220 3141.2830 3147.4565 3164.0637 3568.5427
redmass: 4.3989 4.0364 4.5910 1.2136 2.9373 4.4488 3.7860 3.2541 6.1002 3.1761 2.8016 2.9814 3.8558 2.2642 1.6174 5.9957 5.1808 9.9216 1.9238 1.7589 4.0387 1.2930 3.2016 1.4086 4.4122 1.3972 6.2196 1.3322 2.5390 2.2502 1.6400 1.2559 5.4804 1.4396 1.0545 1.1266 1.9633 2.6282 1.2597 1.3402 1.5021 4.5471 1.1523 2.1206 1.0502 1.0685 1.2287 1.8514 1.8468 6.0718 6.0483 8.9066 1.0632 1.0298 1.0980 1.1047 1.0873 1.0860 1.0912 1.1043 1.0961 1.1015 1.0773
irintensity: 0.5500 0.5102 4.4232 2.4539 8.6246 0.5149 1.5377 12.3116 7.3327 15.3162 0.6382 3.6596 23.4967 42.5927 100.3014 1.9156 11.7961 25.7546 45.0953 42.8507 20.0710 1.0696 12.3247 2.9072 30.6084 0.6301 0.1382 2.4987 22.9336 32.6179 4.9410 0.2825 106.4964 60.3352 0.1129 8.7063 183.0314 3.1128 96.4232 12.8149 5.7199 4.6694 2.9912 22.1202 12.5515 48.2765 30.4057 4.7693 304.4317 0.5829 6.0837 309.6530 42.8740 46.0761 7.2683 31.7063 8.8515 0.6174 13.1962 19.4456 40.7479 21.1633 34.2160
temp: 298.150 k
press: 1.00000 atm
elementType: 8 8 7 6 6 6 6 6 6 6 6 6 1 1 1 1 1 1 1 1 1 1 1
symmnumber: 1
zpe: 485361.6 jmol-1
zpe.correction: 0.184864 hartree
zpe.thermalcorrener: 0.196639 hartree
zpe.thermalcorrenthalpy: 0.197583 hartree
zpe.thermalcorrgfe: 0.144623 hartree
zpe.sumelectzpe: -553.875397 hartree
zpe.sumelectthermal: -553.863622 hartree
zpe.sumelectthermalent: -553.862678 hartree
zpe.sumelectthermalfe: -553.915638 hartree
dipole: 0.8489 0.3297 -2.0304
dipole: 2.2253
quadrupole: -59.9227 -64.2785 -77.0381
quadrupole: -4.0124 3.3042 2.9372
quadrupole: 7.1570 2.8013 -9.9584 -4.0124 3.3042 2.9372
hfenergy: -554.0602612 hartree
pointgroup: C01 [X(C9H11N1O2)]
dipole: -0.3063384 -0.1936568 0.7969752 debye
dipolederiv: -1.4060931 -0.3208819 -0.2648926 -0.3982884 -0.4399375 -0.0606981 -0.6845812 -0.1764928 -0.7131142 -0.764013 -0.1159745 0.0947511 -0.1998822 -0.4081439 0.1343741 0.1614717 0.113323 -0.995902 -1.5235123 -0.2232294 0.1496591 -0.2732983 -0.5801507 0.0301713 0.1755522 0.0309891 -0.362578 0.1569547 -0.073367 -0.1008348 -0.0756658 -0.0545898 -0.0043349 -0.1824455 -0.0040282 -0.0138771 0.6410634 0.0427806 0.0880637 -0.012855 0.3550243 0.0758273 0.4884668 0.1007298 0.143658 -0.1653084 0.0106978 0.000254 0.0350622 0.0796372 0.0524152 -0.0121264 0.0633611 -0.1552986 -0.0600252 0.0922642 -0.0008173 0.1384769 -0.0455764 -0.0031291 0.0279091 -0.006935 -0.1548058 0.0610217 0.0801792 -0.0310426 0.1014493 0.0109734 0.0139302 -0.0080766 0.015484 -0.1394667 -0.032593 -0.0040483 -0.0215815 -0.0195303 0.1223774 0.0596079 -0.026927 0.0568329 -0.1318832 0.0271191 -0.0574923 -0.0552779 -0.0611017 -0.0602029 0.0341112 -0.0494821 0.0355235 -0.1526899 2.1480564 0.5989699 -0.0160849 0.8275097 0.5576567 -0.1773238 0.138577 -0.0628469 1.4502901 0.742661 0.1559667 0.0542467 0.2075408 0.3599803 0.0326055 -0.0672119 -0.0097244 0.2209511 -0.0478156 -0.0743542 -0.0267937 -0.037798 -0.1696582 -0.0466132 -0.0768341 -0.0103961 0.0918278 0.0554235 0.0287077 0.0712094 0.0284721 0.0880118 0.052466 -0.044682 0.009461 0.0123389 0.0953943 0.0465504 0.0198068 0.0186646 -0.1066997 -0.0558717 0.0117403 -0.0588972 0.1385598 -0.0161736 -0.0972502 0.0148822 -0.1157587 0.0406507 -0.0043514 0.0248535 -0.0058816 0.1364359 0.2302604 -0.0811325 -0.0026576 -0.1319917 0.299971 0.0098339 -0.0486442 -0.0004937 0.1519971 -0.0720474 -0.1012178 0.02034 -0.1097781 0.015695 -0.0080628 0.0249 -0.0089681 0.152343 0.0742433 0.0113477 0.0161583 0.0332555 -0.112641 -0.0601898 0.0147834 -0.058918 0.1401052 -0.0897495 0.0709962 0.0622851 0.075108 0.058748 -0.0362829 0.06687 -0.0369362 0.1433787 -0.0045492 0.0355559 -0.0296187 -0.0380215 -0.1101014 0.0553218 0.0504769 0.1062607 0.0757395 -0.0488894 0.0103494 0.0378014 0.043544 -0.0091777 -0.0868826 0.1520235 -0.0642081 0.0256341 -0.0014282 -0.0354176 -0.0798559 -0.0351134 0.1081533 -0.006924 -0.1366134 -0.0272388 -0.0636435 unknown
polarizability: 150.8086379|8.9787093|100.6503901|-8.806979|8.6774864|70.4504547 unknown
InChI: InChI=1S/C9H11NO2/c1-12-9(11)10-7-8-5-3-2-4-6-8/h2-6,10H,7H2,1H3
charge 0 multiplicity 1
23 atoms
O  3.315273 0.154803 0.83915
O  2.682633 0.193024 -1.434936
N  1.291547 -0.690235 0.2476
C  -1.158587 -0.490462 -0.212333
C  0.183433 -1.084897 -0.632493
C  -2.315557 -1.305531 -0.159216
C  -1.274894 0.88784 0.101777
C  -3.569737 -0.75561 0.193965
C  -2.524925 1.438965 0.457924
C  -3.677821 0.618968 0.503949
C  2.435299 -0.096244 -0.234887
C  4.589107 0.793209 0.451626
H  0.103998 -2.189334 -0.675236
H  0.465425 -0.739717 -1.645027
H  -2.236606 -2.374458 -0.395006
H  -0.382712 1.524083 0.06597
H  1.227093 -0.856242 1.252645
H  -4.456725 -1.398058 0.23128
H  -2.602576 2.505768 0.696494
H  -4.647845 1.047057 0.780397
H  4.404603 1.779437 -0.00744
H  5.137877 0.159719 -0.265823
H  5.147698 0.896514 1.393021
