program: Gaussian 09
title: 000232643
version: EM64L-G09RevD.01
frameworkgroup: C1[X(C9H12N2O4S)]
method: RPBEPBE
basis: SDD
operation: Freq
keyword: #p
keyword: freq=noraman
keyword: PBEPBE/SDD
title: #p freq=noraman PBEPBE/SDD
converged: YES YES NO NO
title: Mulliken charges:
elementType: S O O O O N N C C C C C C C C C H H H H H H H H H H H H
charge: 0.911958 -0.523536 -0.527742 -0.195911 -0.188792 -0.487028 0.024212 -0.088372 0.033789 -0.654688 -0.662428 -0.358164 -0.263675 0.403162 -0.167459 -0.350202 0.269610 0.298161 0.220839 0.205131 0.244472 0.254106 0.222174 0.202336 0.327956 0.300462 0.254407 0.295225
chargesum: 0.00000
title: Mulliken charges with hydrogens summed into heavy atoms:
elementType: S O O O O N N C C C C C C C C C
charge: 0.911958 -0.523536 -0.527742 -0.195911 -0.188792 -0.188868 0.024212 0.181238 0.033789 0.015753 0.016188 -0.030208 0.036786 0.403162 0.086948 -0.054977
polarizability: 2.06278587e+02 2.35590930e+00 1.60611565e+02 -8.16820330e+00 -1.51562906e+01 1.04862727e+02
1716.lowfreq: -15.6013 -6.1596 -0.0018 -0.0017 -0.0016 2.3023 10.5345 24.4356 43.6297
frequency: 3.4316 24.1995 43.6167 59.9061 82.8261 103.3450 151.4470 165.2493 197.9894 201.2907 207.8464 225.7237 230.6129 244.3191 268.0814 336.0251 357.4415 375.0886 400.1957 421.8268 429.7365 474.7127 499.1264 515.2391 524.8286 636.9270 670.5011 686.6965 702.1406 787.5448 799.9264 811.3475 822.8678 848.8863 917.9846 924.1093 934.5274 939.0139 942.9080 962.8657 981.3618 1009.3992 1054.7216 1080.4140 1098.7062 1119.6389 1139.1374 1158.5402 1168.7326 1214.3253 1268.3671 1269.2293 1302.9685 1376.2421 1377.4367 1380.1875 1399.0583 1402.8780 1424.6102 1447.2346 1457.5788 1461.0789 1476.5995 1480.1647 1586.2022 1602.3746 2976.9357 2985.2503 3029.9423 3072.8132 3083.8474 3087.2921 3105.2273 3152.9312 3169.0802 3176.1226 3189.0612 3317.1646
redmass: 3.2370 5.6758 5.5938 5.8805 4.2161 8.5258 4.5305 5.3284 1.0997 4.5269 7.3775 5.2608 1.6944 3.9314 2.5752 6.4035 3.0761 5.2937 8.8270 2.8359 2.8056 5.0273 4.7182 7.2050 5.8814 7.2874 3.3604 8.7956 3.9772 4.9512 4.6703 11.4507 1.4041 1.6019 1.8508 1.4466 1.4893 3.1946 1.6618 1.3955 5.9113 1.3618 1.9499 1.8154 2.7700 1.7315 2.3223 1.8655 1.1208 10.2021 1.3140 1.3115 1.4048 7.0952 1.1948 1.2130 1.2145 7.8649 3.0532 2.3881 1.0485 1.0492 1.0488 1.0494 6.9439 7.6914 1.0364 1.0363 1.0849 1.0995 1.0985 1.1000 1.1001 1.0890 1.0937 1.0930 1.0972 1.0738
irintensity: 0.2244 2.2378 0.3929 1.0139 1.9145 4.3546 7.9250 0.6753 0.2261 5.7401 0.9076 4.4617 2.6325 10.9647 3.3935 13.3514 5.1333 22.6355 4.3704 1.5736 3.8334 64.2212 45.1964 2.2123 51.4775 7.6000 11.8473 17.8655 28.1739 75.3170 51.0660 64.4364 28.7617 41.1034 4.9411 1.1175 11.6707 40.2304 14.7896 2.7024 0.9481 1.5378 23.5682 33.6170 19.7841 25.5433 43.4708 25.7728 14.9755 236.2165 0.0149 1.9508 7.8571 66.6396 14.6914 29.3931 10.1687 2.9893 57.7666 24.6768 1.3290 9.1408 10.6232 19.2718 2.8238 3.7597 15.8759 30.4263 1.1435 3.2186 45.0915 26.7004 23.9432 4.8078 7.6842 13.9866 2.5795 12.3458
temp: 298.150 k
press: 1.00000 atm
elementType: 16 8 8 8 8 7 7 6 6 6 6 6 6 6 6 6 1 1 1 1 1 1 1 1 1 1 1 1
symmnumber: 1
zpe: 538410.5 jmol-1
zpe.correction: 0.205070 hartree
zpe.thermalcorrener: 0.222165 hartree
zpe.thermalcorrenthalpy: 0.223109 hartree
zpe.thermalcorrgfe: 0.156503 hartree
zpe.sumelectzpe: -1157.145420 hartree
zpe.sumelectthermal: -1157.128325 hartree
zpe.sumelectthermalent: -1157.127381 hartree
zpe.sumelectthermalfe: -1157.193987 hartree
dipole: -1.7758 1.6673 -4.5038
dipole: 5.1203
quadrupole: -103.8426 -105.7927 -106.0562
quadrupole: 22.4734 3.1667 -4.2133
quadrupole: 1.3879 -0.5622 -0.8257 22.4734 3.1667 -4.2133
hfenergy: -1157.3504901 hartree
pointgroup: C01 [X(C9H12N2O4S1)]
dipole: -0.7823507 -0.6693429 1.7314664 debye
polarizability: 202.1867676|-14.0143153|167.913985|-1.1695489|-8.4793829|101.6521267 unknown
InChI: InChI=1S/C9H12N2O4S/c1-7(2)10-16(14,15)9-5-3-4-8(6-9)11(12)13/h3-7,10H,1-2H3
charge 0 multiplicity 1
28 atoms
S  -1.536102 -0.331248 -0.495368
O  -1.444424 0.695417 -1.755423
O  -2.461524 -1.677387 -0.529716
O  4.908593 -0.042225 0.026255
O  3.491626 1.616308 -0.643284
N  -1.922224 0.723363 1.021884
N  3.731887 0.420506 -0.227707
C  -2.741529 1.940808 0.68785
C  0.222966 -0.903425 -0.090502
C  -2.664546 2.849558 1.935405
C  -4.193356 1.619415 0.271548
C  1.276704 -0.007418 -0.305794
C  0.392148 -2.22099 0.364184
C  2.571088 -0.491122 -0.023299
C  1.707924 -2.667705 0.633193
C  2.80598 -1.803201 0.444914
H  -2.219983 2.433064 -0.153418
H  -2.448843 0.071076 1.64208
H  -3.178023 3.805349 1.726581
H  -3.160832 2.379885 2.805379
H  -1.615778 3.060356 2.202189
H  -4.217055 0.979001 -0.627897
H  -4.740788 2.550492 0.038551
H  -4.734133 1.100497 1.086317
H  1.122471 1.006041 -0.687186
H  -0.478776 -2.875252 0.477595
H  1.873029 -3.690101 0.985675
H  3.8323 -2.122461 0.643997
