program: Gaussian 09
title: 000232621
version: EM64L-G09RevD.01
frameworkgroup: C1[X(C8H10N2O4S)]
method: RPBEPBE
basis: SDD
operation: Freq
keyword: #p
keyword: freq=noraman
keyword: PBEPBE/SDD
title: #p freq=noraman PBEPBE/SDD
converged: YES YES NO NO
title: Mulliken charges:
elementType: S O O O O N N C C C C C C C C H H H H H H H H H H
charge: 0.917482 -0.526883 -0.524570 -0.194929 -0.194887 -0.468213 0.027417 -0.027983 -0.371591 -0.216838 -0.194366 0.395015 -0.328887 -0.330409 -0.651153 0.309242 0.247501 0.266276 0.296660 0.287414 0.298537 0.298140 0.250367 0.209787 0.226872
chargesum: 0.00000
title: Mulliken charges with hydrogens summed into heavy atoms:
elementType: S O O O O N N C C C C C C C C
charge: 0.917482 -0.526883 -0.524570 -0.194929 -0.194887 -0.158971 0.027417 -0.027983 0.142186 0.079822 0.093047 0.395015 -0.030350 -0.032269 0.035874
polarizability: 2.16897764e+02 2.43511433e+00 1.38211655e+02 -1.54116727e+00 -9.76827073e+00 8.90691818e+01
1716.lowfreq: -5.3194 0.0016 0.0020 0.0021 5.8970 8.7312 29.6952 35.9023 47.2616
frequency: 29.4893 35.8389 47.0351 67.3032 80.3015 115.5725 127.7717 185.9964 205.9818 216.4356 235.7253 257.8557 289.8082 324.6837 361.8479 369.1729 411.5209 424.7245 437.2273 496.0510 505.6527 521.6768 612.7475 662.6595 681.4933 737.1236 749.3050 781.5982 802.7722 827.4905 852.7944 871.8133 882.0739 940.5571 991.7728 993.8788 1001.4266 1044.9676 1048.6735 1082.8456 1086.4808 1101.4121 1109.7782 1170.0292 1217.0205 1256.4542 1280.8386 1301.2990 1370.3240 1377.5108 1393.2331 1397.3558 1423.2427 1437.6859 1452.1289 1469.6910 1475.5798 1582.5443 1607.9164 2981.8800 2998.0230 3058.1365 3082.4270 3090.9517 3161.1998 3165.9773 3188.5814 3190.8670 3338.0843
redmass: 4.6508 5.0246 3.7887 6.2494 3.5525 8.7585 5.4413 2.1392 6.3017 6.4581 3.1583 3.0377 4.1752 4.4200 3.9576 7.6859 2.8761 6.6641 4.1043 4.3173 7.1445 5.9783 7.1023 4.9036 8.2537 4.2359 1.2334 8.9986 12.6913 1.8764 1.2592 1.5326 1.9101 6.0175 1.3740 5.0985 1.3738 3.0701 2.3632 1.8460 4.0287 1.3696 1.4963 1.2331 8.7762 1.1757 1.2460 1.2207 6.4383 1.1959 5.7152 1.2073 6.8174 1.0716 2.1790 1.0462 1.0443 6.2436 8.4382 1.0361 1.0637 1.0985 1.0991 1.1014 1.0908 1.0906 1.0951 1.0965 1.0742
irintensity: 0.1727 0.8224 0.6074 0.0564 2.9193 7.2542 5.7291 0.8937 6.3688 4.3440 2.8789 7.9097 3.9682 0.6964 8.7742 53.2764 0.0322 27.6944 1.5895 24.8878 2.8225 100.6921 0.0607 23.7385 25.0031 7.4305 71.3007 58.9243 66.4330 60.4398 3.4577 45.3358 22.0483 55.5673 3.8194 5.1458 0.3054 28.0926 14.7700 3.7713 5.6292 27.7951 8.6641 12.7396 273.2222 6.5915 0.1792 13.8989 55.5980 5.3766 59.0346 19.9181 48.9983 17.3510 9.3248 10.8499 15.4421 29.9487 0.4313 20.3125 12.4403 1.4620 31.1658 22.9021 4.7488 3.4275 3.0749 1.1301 12.4566
temp: 298.150 k
press: 1.00000 atm
elementType: 16 8 8 8 8 7 7 6 6 6 6 6 6 6 6 1 1 1 1 1 1 1 1 1 1
symmnumber: 1
zpe: 467024.0 jmol-1
zpe.correction: 0.177880 hartree
zpe.thermalcorrener: 0.193408 hartree
zpe.thermalcorrenthalpy: 0.194352 hartree
zpe.thermalcorrgfe: 0.133167 hartree
zpe.sumelectzpe: -1117.918268 hartree
zpe.sumelectthermal: -1117.902740 hartree
zpe.sumelectthermalent: -1117.901796 hartree
zpe.sumelectthermalfe: -1117.962981 hartree
dipole: -3.3134 -0.9680 -2.9462
dipole: 4.5382
quadrupole: -113.1792 -95.1051 -98.8708
quadrupole: 7.3694 13.7453 -2.9971
quadrupole: -10.7942 7.2799 3.5143 7.3694 13.7453 -2.9971
hfenergy: -1118.0961478 hartree
pointgroup: C01 [X(C8H10N2O4S1)]
dipole: 1.0404301 -1.1990108 0.8171837 debye
dipolederiv: 2.0604018 -0.2892565 0.1685691 -0.2314161 1.290712 -0.1318698 0.1792476 -0.1810532 1.1765667 -0.7476051 0.10062 -0.0166651 0.1132736 -0.4691382 -0.027781 0.0345057 0.0927867 -0.6318665 -0.7437631 0.0215764 -0.0536456 0.0622253 -0.7655776 0.0486298 -0.0875313 -0.1296839 -0.482046 -0.7434287 0.164522 0.1195752 0.1360322 -0.4180565 -0.2118265 0.1173638 -0.2207714 -0.4559186 -0.7516624 -0.0822372 -0.1690044 -0.0908799 -0.383678 -0.2092701 -0.1486987 -0.1995756 -0.4745801 -0.7963024 0.0952993 0.0304749 0.0927847 -0.3005404 0.076898 0.0861165 0.1421748 -0.3820162 1.8259613 -0.1223662 0.0692709 -0.0743586 0.572905 0.4386982 0.0492141 0.4375805 0.7059181 0.1444916 -0.0781836 0.0325019 -0.1291705 -0.0707373 0.0547438 0.0833306 0.0657587 -0.059448 0.4958671 -0.1670653 0.0321632 -0.0185618 0.113448 0.0037524 -0.2305185 0.1893131 0.0267921 -0.3876941 0.1961913 0.1383467 -0.0079917 -0.0598597 0.0272853 -0.0693998 0.0259876 -0.0706988 -0.3928214 -0.0843037 -0.1867921 0.0641538 -0.0590162 0.0229038 0.0061803 0.0266368 -0.043775 -0.5915872 0.0623918 -0.0304245 0.0329465 0.0716948 0.0095705 -0.0167804 0.0099382 0.0786361 0.1058073 -0.1268773 -0.1205291 0.1461774 -0.0707698 0.0353752 0.1657898 0.0013487 -0.0572029 0.1059759 0.0968736 0.1388914 -0.1481146 -0.0586196 0.0076545 -0.1795577 0.0411662 -0.0648288 -0.2299384 0.0079598 -0.012802 -0.0246521 -0.0055105 0.005798 0.0262107 -0.0437322 0.107752 0.1858896 0.030893 -0.1041639 0.0921896 0.0255262 -0.0425312 -0.0330125 -0.0735114 0.1178945 -0.0655298 0.0749544 -0.0076229 0.0015978 -0.096645 0.0746558 0.0504564 0.049256 0.1042204 0.0315899 -0.0044464 -0.0577781 -0.0715869 0.1564397 0.0033911 -0.0297157 -0.0673263 -0.0260263 0.1260856 -0.0509306 -0.0406228 -0.0215861 0.1265655 -0.0375932 -0.0239822 -0.0245319 0.1125175 0.1146666 0.0303839 0.0503553 0.0259387 0.1083687 -0.032826 0.0283189 -0.0425189 0.1095062 0.0842109 0.0384802 0.0336393 0.0081128 0.1314536 -0.0484708 0.0087538 -0.0453682 0.1221004 0.0822788 -0.0261033 -0.0418948 -0.008057 0.1364961 -0.0439345 -0.0064421 -0.047724 0.1176409 0.1110275 0.0008914 -0.0166925 -0.0476671 -0.0582153 0.0681342 -0.0053992 0.0850051 0.0400915 0.0680968 -0.0167273 0.014439 -0.0331257 0.0885159 -0.0329258 -0.0667559 -0.0243451 -0.1503756 -0.0920182 0.1274603 0.0304108 0.1317356 -0.0057614 -0.0584616 0.0623057 -0.0668104 0.0791465 unknown
polarizability: 211.8247935|-22.3729564|118.0386804|9.0170772|25.0333147|114.3151264 unknown
InChI: InChI=1S/C8H10N2O4S/c1-2-9-15(13,14)8-5-3-7(4-6-8)10(11)12/h3-6,9H,2H2,1H3
charge 0 multiplicity 1
25 atoms
S  2.045656 0.164856 -0.035718
O  2.5421 -0.181913 -1.548255
O  2.551227 1.483166 0.783406
O  -4.654304 1.228275 0.680339
O  -4.688081 -0.256006 -1.051992
N  2.335826 -1.394136 0.9912
N  -4.07097 0.456025 -0.171703
C  0.155409 0.233274 -0.066044
C  3.446485 -2.233085 0.448188
C  -0.482014 1.081371 0.853732
C  -0.520463 -0.534258 -1.028869
C  -2.58317 0.379518 -0.135312
C  -1.890007 1.156311 0.818109
C  -1.927507 -0.458814 -1.064326
C  4.869897 -1.703466 0.707162
H  2.552582 -1.019727 1.938171
H  3.29618 -3.228786 0.90947
H  3.267162 -2.345826 -0.636138
H  0.109038 1.680859 1.553184
H  0.037354 -1.151523 -1.739332
H  -2.450083 1.79748 1.503213
H  -2.516701 -1.027841 -1.787601
H  5.028007 -0.736949 0.196488
H  5.060172 -1.563417 1.787754
H  5.619904 -2.417092 0.320473
