program: Gaussian 09
title: 000232638
version: EM64L-G09RevD.01
frameworkgroup: C1[X(C16H26N2O3)]
method: RPBEPBE
basis: SDD
operation: Freq
keyword: #p
keyword: freq=noraman
keyword: PBEPBE/SDD
title: #p freq=noraman PBEPBE/SDD
converged: YES YES NO NO
title: Mulliken charges:
elementType: O O O N N C C C C C C C C C C C C C C C C H H H H H H H H H H H H H H H H H H H H H H H H H H
charge: -0.298874 -0.286785 -0.270885 -0.298902 -0.691967 -0.064645 -0.372080 -0.386940 -0.296832 -0.698455 -0.682030 -0.281812 -0.341794 0.230124 0.274211 0.309538 -0.685936 -0.533222 -0.303352 -0.398300 0.161173 0.206702 0.227563 0.214351 0.245498 0.209270 0.209268 0.219880 0.236873 0.198122 0.237218 0.206281 0.202542 0.229536 0.210966 0.206751 0.206958 0.195376 0.195494 0.212224 0.219608 0.212394 0.263714 0.243686 0.266268 0.307416 0.333805
chargesum: 0.00000
title: Mulliken charges with hydrogens summed into heavy atoms:
elementType: O O O N N C C C C C C C C C C C C C C C C
charge: -0.298874 -0.286785 -0.270885 -0.053404 -0.050746 0.142057 0.069834 0.031598 0.159922 -0.056835 -0.038986 0.131896 0.049077 0.230124 0.274211 0.309538 -0.041710 -0.269508 -0.059666 -0.132032 0.161173
polarizability: 3.24377024e+02 -2.08100565e+00 1.89998601e+02 1.54274972e+01 1.46921197e+01 1.39744365e+02
1716.lowfreq: -11.9551 -3.2039 -0.0017 0.0004 0.0011 3.7617 14.4262 20.5870 23.6334
frequency: 14.1757 20.3834 23.2290 33.0560 51.0282 56.2078 62.0469 83.6224 88.0159 106.7477 123.4424 136.6982 144.1640 180.5631 195.2905 202.2601 209.3315 212.3680 231.1997 241.0927 254.0036 298.2899 304.6160 330.4611 344.5497 368.4505 371.2135 393.9079 427.9491 446.9641 447.9071 471.7150 473.3144 503.0616 538.2006 565.2440 574.5108 635.0666 660.3636 711.4306 734.5741 743.4728 747.3664 764.0878 803.3466 806.7063 820.1987 832.0364 874.9883 900.3654 903.9900 911.0217 921.9113 933.7081 937.0320 942.2329 959.0808 972.6569 1024.0987 1043.1209 1060.5063 1069.5538 1083.4057 1086.5813 1113.8580 1123.9263 1132.1664 1141.2160 1147.5137 1172.7267 1184.0516 1195.2617 1214.1791 1223.2937 1234.1137 1273.8407 1279.1797 1280.7358 1284.7785 1285.5817 1306.0139 1308.8611 1317.0950 1342.4782 1347.6631 1368.5964 1378.3792 1383.8094 1387.8652 1392.3500 1421.6862 1444.6734 1451.3918 1454.0350 1463.6929 1464.9174 1470.5363 1473.5055 1477.8050 1480.3992 1482.5061 1484.1382 1488.7192 1491.1734 1511.0574 1589.4394 1604.2759 1613.5924 1633.2741 2919.9642 2950.5565 2967.3769 2968.4845 2972.9292 2976.1748 2977.4065 2991.7265 3006.9490 3012.8569 3021.5606 3033.8480 3057.3245 3061.2723 3070.9657 3072.5059 3074.4378 3076.9290 3094.1980 3119.5105 3144.5384 3156.3491 3187.5879 3424.4229 3568.3076 3716.0134
redmass: 3.7357 3.5843 3.2202 4.6061 3.5812 2.3719 2.8141 3.6847 3.7538 3.0654 3.5001 2.6966 2.7421 2.6685 4.2333 4.0549 1.3394 2.1076 1.1114 3.8423 1.1856 3.4740 3.2412 2.7264 2.9201 2.7860 1.6488 4.3532 2.7269 2.6326 2.3565 3.9289 1.2293 3.1360 5.6886 3.9968 5.1836 6.2161 1.6090 4.7501 3.7861 1.0817 3.5542 5.6651 1.3409 1.5969 1.2501 1.7829 5.5601 1.5418 1.8105 1.2540 1.7962 1.3074 1.5694 1.1899 4.2158 6.4837 2.0529 3.3776 2.2516 1.8947 2.1638 2.2240 3.0849 2.6195 2.1702 1.5012 1.4585 1.9315 1.8312 3.4160 1.3663 2.6869 1.5593 1.3052 1.1649 1.1783 1.4317 1.0738 1.4261 2.2335 1.3236 1.2632 1.4662 1.2266 1.4582 1.3386 1.2469 1.2238 8.3364 1.2149 1.6270 1.7572 1.0561 1.0501 1.0800 1.0741 1.0423 1.0803 1.0931 1.0521 1.0850 1.1133 3.0813 5.9209 1.8860 5.6209 2.8083 1.0680 1.0553 1.0354 1.0589 1.0561 1.0364 1.0645 1.0590 1.1041 1.1027 1.0670 1.0854 1.1047 1.0989 1.0975 1.0994 1.1014 1.0994 1.1001 1.1052 1.0916 1.0883 1.0952 1.0738 1.0442 1.1047
irintensity: 0.5493 0.2280 0.1519 0.3288 0.6844 0.0689 1.5120 0.0614 0.2666 0.6802 0.1355 0.1499 5.3808 2.2737 3.2260 3.0241 1.2213 1.2534 0.1080 0.1031 1.3943 9.8796 5.8882 73.7330 16.7291 14.0302 149.1048 2.2157 7.2898 1.2817 7.1276 1.6026 61.6268 14.7172 11.8368 7.1603 3.2783 11.1654 88.9403 29.2426 10.4737 12.1131 14.2527 18.3932 13.0794 4.6987 10.8832 4.5949 12.6247 29.5417 25.3050 3.5470 12.5996 0.4845 15.9308 1.0692 148.4516 55.3386 110.4974 19.2064 18.6984 36.9024 21.1169 115.5093 75.0376 6.5584 14.3584 256.5208 2.0387 45.4405 73.0559 418.7907 0.0117 85.8951 14.0541 2.9928 0.2817 2.6082 0.2763 0.1287 61.1935 120.2314 25.1251 23.8117 0.0791 28.1863 29.7756 10.2127 19.8651 4.5227 14.4958 15.9103 22.8283 110.5167 9.9128 1.4067 4.3448 1.7717 13.2307 9.6919 33.8421 16.1164 7.8251 31.1409 170.7856 40.3876 79.4043 274.5362 171.4259 58.5045 29.0905 26.0437 31.4921 16.5245 35.8861 38.1717 40.5570 23.6164 0.4334 34.2624 24.5059 23.5471 4.5678 96.6294 45.0794 100.6403 48.5571 35.9616 16.7728 7.2389 15.7893 2.6525 0.7200 81.1769 37.0037
temp: 298.150 k
press: 1.00000 atm
elementType: 8 8 8 7 7 6 6 6 6 6 6 6 6 6 6 6 6 6 6 6 6 1 1 1 1 1 1 1 1 1 1 1 1 1 1 1 1 1 1 1 1 1 1 1 1 1 1
symmnumber: 1
zpe: 1048866.2 jmol-1
zpe.correction: 0.399492 hartree
zpe.thermalcorrener: 0.423761 hartree
zpe.thermalcorrenthalpy: 0.424705 hartree
zpe.thermalcorrgfe: 0.342047 hartree
zpe.sumelectzpe: -958.837234 hartree
zpe.sumelectthermal: -958.812966 hartree
zpe.sumelectthermalent: -958.812021 hartree
zpe.sumelectthermalfe: -958.894679 hartree
dipole: 3.4980 -1.3357 1.2195
dipole: 3.9379
quadrupole: -98.0811 -120.0949 -130.3681
quadrupole: 0.6227 -2.8778 2.8498
quadrupole: 18.1002 -3.9135 -14.1867 0.6227 -2.8778 2.8498
hfenergy: -959.2367264 hartree
pointgroup: C01 [X(C16H26N2O3)]
dipole: 1.3730473 -0.5856726 0.4147973 debye
polarizability: 324.2030769|-4.4157158|185.4016799|15.9858076|20.5990653|144.5152329 unknown
InChI: InChI=1S/C16H26N2O3/c1-4-5-9-20-15-7-6-13(11-14(15)17)16(19)21-10-8-18-12(2)3/h6-7,11-12,18H,4-5,8-10,17H2,1-3H3
charge 0 multiplicity 1
47 atoms
O  4.01765 0.224339 0.162729
O  -2.222306 -0.323398 -1.291053
O  -2.23066 1.807061 -0.333039
N  -5.91412 -0.547351 -0.560502
N  2.775853 2.460682 0.920123
C  -6.841876 -1.352154 0.276937
C  -4.470156 -0.688801 -0.28481
C  6.236005 -0.750193 0.124703
C  -3.687271 -0.202077 -1.517427
C  -8.271724 -1.196904 -0.280465
C  -6.790918 -1.006384 1.791603
C  4.768263 -0.979357 -0.24083
C  7.123312 -1.956729 -0.262819
C  2.633738 0.252882 -0.087146
C  -0.140037 0.555026 -0.484175
C  1.997302 1.46991 0.331616
C  8.607384 -1.7347 0.098829
C  0.606706 1.59937 0.123056
C  1.893154 -0.784953 -0.688173
C  0.502998 -0.639844 -0.889756
C  -1.597674 0.771543 -0.670117
H  -6.533228 -2.41079 0.153851
H  -4.113606 -0.13187 0.611412
H  -4.252915 -1.760438 -0.116695
H  -6.203428 0.441121 -0.593271
H  6.312809 -0.561775 1.213004
H  6.597555 0.161778 -0.388457
H  -3.929883 0.852937 -1.741446
H  -3.896635 -0.83784 -2.39077
H  -8.610842 -0.145114 -0.199767
H  -8.302693 -1.486992 -1.344781
H  -8.986541 -1.823842 0.282454
H  -7.131515 0.0333 1.963387
H  -5.764714 -1.101537 2.191191
H  -7.446155 -1.681175 2.374126
H  4.356797 -1.862212 0.29129
H  4.648908 -1.135525 -1.33318
H  6.751001 -2.86859 0.246996
H  7.033264 -2.147296 -1.351669
H  8.730729 -1.570951 1.185745
H  9.224824 -2.606491 -0.183955
H  9.014315 -0.848302 -0.422806
H  0.07902 2.510756 0.425573
H  2.388129 -1.708426 -1.002534
H  -0.080621 -1.436207 -1.356561
H  2.362915 3.335268 1.226698
H  3.772189 2.300243 1.037785
