program: Gaussian 09
title: 000232616
version: EM64L-G09RevD.01
frameworkgroup: C1[X(C12H17NO)]
method: RPBEPBE
basis: SDD
operation: Freq
keyword: #p
keyword: freq=noraman
keyword: PBEPBE/SDD
title: #p freq=noraman PBEPBE/SDD
converged: YES YES NO NO
title: Mulliken charges:
elementType: O N C C C C C C C C C C C C H H H H H H H H H H H H H H H H H
charge: -0.281919 -0.312835 -0.119076 -0.097450 -0.463788 -0.335983 -0.353405 0.422743 -0.711429 -0.427105 -0.395673 -0.228740 -0.223666 -0.242615 0.211087 0.213094 0.207764 0.230498 0.208248 0.201597 0.265655 0.221509 0.196340 0.210438 0.209321 0.225048 0.230441 0.267709 0.223308 0.222998 0.225885
chargesum: 0.00000
title: Mulliken charges with hydrogens summed into heavy atoms:
elementType: O N C C C C C C C C C C C C
charge: -0.281919 -0.047180 0.092011 0.115645 -0.025526 0.073861 0.064444 0.422743 -0.066622 -0.196663 -0.127965 -0.005432 -0.000667 -0.016730
polarizability: 1.75525075e+02 3.59812999e+00 1.26608562e+02 -1.22808518e+01 8.11386788e+00 9.87674348e+01
1716.lowfreq: -0.0005 0.0006 0.0006 3.2225 8.1214 15.2128 28.5228 40.5932 82.1910
frequency: 28.4731 40.4188 82.1768 101.8668 156.5398 185.5381 234.8778 246.6332 280.8174 298.1232 341.7540 388.3959 402.2149 430.3250 482.0550 491.0384 525.2469 589.8300 615.8261 618.0062 705.0720 717.1373 745.1977 760.5711 810.4841 828.5173 856.9224 873.2333 906.2520 920.3697 932.2861 979.2462 989.7201 993.2323 996.5759 1021.8897 1024.4528 1036.0066 1048.5687 1071.6489 1083.0831 1087.3613 1124.6391 1170.7852 1171.5496 1183.4104 1201.7228 1218.2413 1239.9450 1247.3326 1251.4847 1278.9440 1313.5073 1313.8311 1333.8422 1345.1720 1358.6494 1371.8501 1386.3873 1389.9798 1438.1100 1442.9177 1450.6029 1458.4694 1476.0315 1479.6336 1484.0926 1488.5102 1593.3545 1616.5539 2897.4679 2942.6521 2961.0722 2969.8638 2977.5172 2981.6227 3030.7095 3040.3859 3063.5767 3072.9356 3076.6695 3112.0017 3124.5996 3138.5569 3155.9930 3169.2234 3473.0171
redmass: 3.6742 3.5637 2.2768 4.0696 2.9824 2.8534 1.3155 4.2806 3.4842 2.2181 3.7568 2.4024 2.8457 2.9608 2.8664 2.7321 3.0429 1.9079 5.8997 4.2494 1.8458 2.5695 1.8269 1.7831 1.8246 2.8940 1.2499 2.4327 2.3912 1.7245 1.8818 1.3780 5.7353 1.6096 1.3685 2.9539 2.2206 2.1819 2.8844 2.2923 1.8228 2.0023 2.1987 1.7788 1.3274 1.1107 1.5572 1.2653 1.1691 1.4764 1.2757 1.4314 1.3978 1.2402 1.3418 1.3863 1.3156 1.5861 5.0542 1.2263 2.1207 1.3147 1.1034 1.0907 1.0682 1.0604 2.3600 1.0586 6.1987 6.1485 1.0692 1.0832 1.0681 1.0364 1.0650 1.0787 1.0985 1.0912 1.1006 1.0982 1.0986 1.0870 1.0868 1.0928 1.0973 1.0978 1.0752
irintensity: 0.1959 0.0888 0.3031 1.2137 2.2881 3.4065 0.5572 1.1818 0.6374 5.9391 1.9178 0.8730 0.2844 23.2496 8.3534 11.5407 19.7100 102.9160 4.4569 25.4140 50.1008 30.8170 14.0681 44.4768 8.9627 6.9603 0.0967 3.7600 13.0068 5.8758 11.2473 0.1457 0.0092 13.3679 3.7090 23.1956 27.5704 46.9561 6.1679 31.0583 1.8258 4.7872 2.1783 20.1539 14.5618 3.5469 1.0310 4.5964 7.9417 9.0002 1.0788 4.5320 5.2120 19.6710 7.7352 7.0431 1.0960 2.4959 0.7063 18.4060 10.0611 1.3138 11.5519 4.3070 3.5424 13.3347 14.3750 10.9477 1.3506 5.3125 51.7641 46.5957 42.5074 34.3439 29.8293 78.7330 13.4771 30.5476 73.3617 28.8339 51.5934 8.9935 1.2208 32.9848 33.8707 9.5769 1.3297
temp: 298.150 k
press: 1.00000 atm
elementType: 8 7 6 6 6 6 6 6 6 6 6 6 6 6 1 1 1 1 1 1 1 1 1 1 1 1 1 1 1 1 1
symmnumber: 1
zpe: 699488.8 jmol-1
zpe.correction: 0.266421 hartree
zpe.thermalcorrener: 0.279470 hartree
zpe.thermalcorrenthalpy: 0.280414 hartree
zpe.thermalcorrgfe: 0.226022 hartree
zpe.sumelectzpe: -596.361578 hartree
zpe.sumelectthermal: -596.348529 hartree
zpe.sumelectthermalent: -596.347585 hartree
zpe.sumelectthermalfe: -596.401978 hartree
dipole: -1.5289 -0.2344 -1.3735
dipole: 2.0685
quadrupole: -74.9588 -81.9307 -86.4512
quadrupole: -0.4830 -2.7282 1.7377
quadrupole: 6.1548 -0.8171 -5.3376 -0.4830 -2.7282 1.7377
hfenergy: -596.627999 hartree
pointgroup: C01 [X(C12H17N1O1)]
dipole: -0.6019078 0.0675886 0.5435491 debye
polarizability: 175.6361102|-3.3712025|125.9741622|11.9834367|9.1339025|99.2907991 unknown
InChI: InChI=1S/C12H17NO/c1-2-11-9-14-12(8-13-11)10-6-4-3-5-7-10/h3-7,11-13H,2,8-9H2,1H3
charge 0 multiplicity 1
31 atoms
O  -0.690048 -0.017565 -1.370557
N  -2.243462 1.139688 0.709944
C  -2.939779 0.376435 -0.358295
C  -0.033024 0.784811 -0.315467
C  -0.866517 0.680015 0.98816
C  -2.058123 0.474071 -1.623227
C  -3.281273 -1.105134 -0.011224
C  1.384314 0.275105 -0.132316
C  -4.066625 -1.259439 1.307281
C  2.377678 1.139866 0.391492
C  1.724583 -1.067602 -0.42895
C  3.689135 0.669995 0.625898
C  3.037933 -1.536946 -0.200318
C  4.023254 -0.672787 0.331517
H  -3.88971 0.909801 -0.571212
H  -0.029315 1.852526 -0.629721
H  -0.799016 -0.372824 1.352054
H  -0.419064 1.33193 1.760468
H  -2.446201 -0.162829 -2.435957
H  -2.013109 1.531399 -1.959324
H  -2.810572 1.258644 1.557057
H  -2.347479 -1.698354 0.029865
H  -3.878992 -1.522521 -0.846849
H  -3.466043 -0.934752 2.178195
H  -4.997942 -0.660069 1.295083
H  -4.348905 -2.313674 1.480201
H  2.127475 2.186202 0.609705
H  0.960476 -1.722046 -0.85901
H  4.449115 1.34924 1.028745
H  3.293935 -2.575553 -0.439874
H  5.041301 -1.03843 0.507736
