program: Gaussian 09
title: 000232615
version: EM64L-G09RevD.01
frameworkgroup: C1[X(C10H16O)]
method: RPBEPBE
basis: SDD
operation: Freq
keyword: #pfreq=noraman
keyword: PBEPBE/SDD
title: #p freq=noraman PBEPBE/SDD
converged: YES YES NO NO
title: Mulliken charges:
elementType: O C C C C C C C C C C H H H H H H H H H H H H H H H H
charge: -0.453890 -0.042919 -0.418863 0.191938 -0.694220 -0.713331 -0.747857 0.051408 -0.090119 -0.161003 -0.544198 0.202560 0.207272 0.227093 0.194151 0.255437 0.201634 0.209285 0.209258 0.213953 0.223702 0.242511 0.217699 0.337313 0.227502 0.218244 0.235438
chargesum: 0.00000
title: Mulliken charges with hydrogens summed into heavy atoms:
elementType: O C C C C C C C C C C
charge: -0.116577 0.159641 0.015502 0.191938 -0.042998 -0.080834 -0.063945 0.051408 -0.090119 0.066499 -0.090515
polarizability: 1.70975680e+02 1.70290153e+01 9.70592632e+01 5.72438008e+00 5.48475120e+00 9.15274576e+01
1716.lowfreq: -21.0305 -6.6579 -3.5365 0.0005 0.0009 0.0010 12.2908 31.7872 61.0505
frequency: 10.3923 31.4935 61.0471 70.4311 120.6324 183.3037 196.6213 205.7672 235.7761 258.0767 261.1697 280.1874 302.0996 323.9941 348.4889 374.6789 415.6556 421.9543 504.8058 540.5985 561.0533 683.4574 685.3623 780.9430 837.3958 855.9584 903.1483 922.5843 953.3662 959.3336 961.2614 982.5127 987.9536 1020.4943 1079.3876 1101.7104 1130.5439 1157.6040 1179.0443 1210.2145 1257.4617 1282.1539 1285.5466 1306.4410 1335.3447 1350.8987 1379.1088 1382.3288 1398.1584 1421.3154 1441.9816 1463.8650 1464.1146 1471.1992 1474.6900 1480.8122 1489.1537 1615.1538 2239.8833 2965.5216 2968.8775 2973.9886 2984.0818 2989.0465 3045.5952 3056.8177 3064.7307 3069.0230 3083.2546 3087.9569 3101.7314 3103.1155 3109.2306 3220.2035 3538.7535
redmass: 2.4224 2.8752 3.0809 3.2939 2.4929 2.9828 2.6096 1.1940 1.1248 1.5558 1.7940 1.5176 1.9294 2.6027 2.4805 3.0292 1.9190 2.6948 3.8869 4.1268 4.6561 2.6060 2.2077 3.3250 2.2606 2.0598 1.9662 1.2123 1.3283 1.9188 1.5046 1.1400 1.6777 1.6299 1.6406 1.8470 2.2760 2.2599 1.7867 3.2114 1.3050 1.2744 1.3732 1.4886 1.4091 1.5562 1.2061 1.2045 1.2073 1.2565 1.0818 1.0456 1.0614 1.0529 1.0524 1.0467 1.0538 4.2184 11.9126 1.0366 1.0809 1.0381 1.0579 1.0373 1.1017 1.0996 1.0992 1.0990 1.0998 1.0811 1.0980 1.0996 1.0683 1.1164 1.0660
irintensity: 0.0326 0.0593 0.5752 1.1206 0.9571 1.5189 0.3790 1.2794 0.3595 28.4514 5.7128 58.2404 31.0458 51.5305 3.8193 5.1550 4.7771 0.4930 1.9916 8.1907 9.7115 17.3489 1.5935 5.0470 17.9891 3.5475 17.1440 4.4965 81.1790 7.5645 1.6289 17.0922 12.6478 24.4535 1.4919 44.4757 9.1333 18.5202 16.4079 65.2827 0.9071 2.9531 14.5710 44.7524 0.8882 31.5104 16.7283 24.6249 15.4410 7.0309 2.3370 5.0939 7.2529 2.6036 16.2427 14.4667 14.9006 30.3388 2.2206 33.5458 12.2000 52.5940 31.2907 11.4506 8.9280 11.2819 76.7415 74.6925 32.4530 16.5310 26.5471 21.8551 5.7187 18.0845 7.7133
temp: 298.150 k
press: 1.00000 atm
elementType: 8 6 6 6 6 6 6 6 6 6 6 1 1 1 1 1 1 1 1 1 1 1 1 1 1 1 1
symmnumber: 1
zpe: 604126.4 jmol-1
zpe.correction: 0.230100 hartree
zpe.thermalcorrener: 0.244387 hartree
zpe.thermalcorrenthalpy: 0.245331 hartree
zpe.thermalcorrgfe: 0.187427 hartree
zpe.sumelectzpe: -464.929619 hartree
zpe.sumelectthermal: -464.915332 hartree
zpe.sumelectthermalent: -464.914388 hartree
zpe.sumelectthermalfe: -464.972292 hartree
dipole: 1.1410 -0.4537 -1.2596
dipole: 1.7591
quadrupole: -62.1761 -66.1462 -68.9835
quadrupole: -0.2341 1.7650 1.9100
quadrupole: 3.5925 -0.3776 -3.2149 -0.2341 1.7650 1.9100
hfenergy: -465.159719 hartree
pointgroup: C01 [X(C10H16O1)]
dipole: -0.4401309 -0.0864039 0.5270421 debye
polarizability: 170.5586023|-17.6351089|95.8920166|6.6786961|-5.8996706|93.1117815 unknown
InChI: InChI=1S/C10H16O/c1-5-6-7-10(4,11)8-9(2)3/h5,9,11H,1,8H2,2-4H3
charge 0 multiplicity 1
27 atoms
O  0.444886 -1.64355 -0.959965
C  2.675542 0.346534 0.0881
C  1.137399 0.514795 -0.043134
C  0.243288 -0.73632 0.213517
C  3.291255 -0.528536 -1.029926
C  3.335029 1.748481 0.09685
C  0.610716 -1.495385 1.513402
C  -1.179849 -0.319076 0.255339
C  -2.370383 0.024399 0.266483
C  -3.750943 0.40049 0.331102
C  -4.455296 0.979168 -0.685977
H  2.896277 -0.129962 1.065895
H  0.807006 1.293287 0.67264
H  0.892928 0.884964 -1.057564
H  4.384691 -0.625516 -0.888889
H  2.838463 -1.532561 -1.054634
H  3.114793 -0.066184 -2.020207
H  3.121748 2.286361 -0.847321
H  2.962915 2.370522 0.932972
H  4.433466 1.665878 0.194186
H  0.589183 -0.818684 2.386291
H  1.620716 -1.92778 1.420014
H  -0.10584 -2.315663 1.699127
H  -0.244376 -2.356634 -0.915237
H  -4.26391 0.196383 1.282824
H  -5.512511 1.236112 -0.561576
H  -3.989194 1.201579 -1.651611
