program: Gaussian 09
title: 000232608
version: EM64L-G09RevD.01
frameworkgroup: C1[X(C8H7NO3)]
method: RPBEPBE
basis: SDD
operation: Freq
keyword: #pfreq=noraman
keyword: PBEPBE/SDD
title: #p freq=noraman PBEPBE/SDD
converged: NO YES NO NO
title: Mulliken charges:
elementType: O O O N C C C C C C C C H H H H H H H
charge: -0.412843 -0.225164 -0.239203 0.098628 0.495463 -0.352408 -0.343854 -0.388129 -0.336990 0.290024 -0.265952 -0.201115 0.241795 0.234181 0.231273 0.261678 0.276600 0.271302 0.364712
chargesum: 0.00000
title: Mulliken charges with hydrogens summed into heavy atoms:
elementType: O O O N C C C C C C C C
charge: -0.048131 -0.225164 -0.239203 0.098628 0.495463 -0.110613 -0.109673 -0.156856 -0.075312 0.290024 0.010648 0.070187
polarizability: 2.46353560e+02 9.67845100e+00 1.07945394e+02 -1.57621193e-03 -3.91947810e-03 4.02506244e+01
1716.lowfreq: -3.5107 -0.0004 0.0001 0.0004 3.2631 5.2486 48.5062 67.6625 93.8752
frequency: 48.4465 67.6352 93.8743 151.1987 210.4632 232.0187 304.5469 370.9960 398.4013 403.6936 418.2103 512.8312 514.7145 535.7750 635.7008 660.5570 671.1896 735.2366 786.5719 808.6075 836.7352 849.4642 850.2322 938.9100 942.0294 968.2781 1000.6065 1003.6907 1105.6049 1142.5889 1182.7063 1198.8436 1221.8745 1254.1481 1273.4194 1294.8532 1328.6618 1377.3755 1397.1163 1441.6293 1505.1078 1580.8587 1622.1119 1633.6473 3116.8129 3124.4020 3147.8422 3150.0720 3178.3112 3202.2013 3575.5571
redmass: 6.1089 8.2677 7.1436 4.1452 3.5510 9.9308 6.8450 3.1983 4.3327 1.3220 2.2353 2.3798 6.4712 6.1569 6.8918 5.2360 9.6256 3.8814 5.6192 1.3338 1.5468 5.4312 1.7475 5.7007 1.3509 1.3672 2.7518 1.2637 1.4694 1.3790 1.2358 1.7136 2.5489 1.9154 3.2309 1.9353 1.3114 4.5247 4.2955 3.7921 2.7666 5.9647 6.0794 5.8106 1.0891 1.0882 1.0916 1.0943 1.0966 1.0950 1.0661
irintensity: 0.2390 1.2032 2.7125 3.3360 0.0865 0.7357 1.0810 2.7468 17.2027 129.9884 21.1750 32.2107 8.4189 20.4751 0.7295 0.4281 2.6740 0.1517 15.0511 30.1673 73.7887 1.2788 2.7215 24.9163 2.5998 0.7145 0.8831 46.1228 70.3402 452.0369 163.6259 137.8398 292.2650 53.3737 17.7994 0.5734 49.3958 122.0881 1.3745 5.3822 108.7064 57.1752 382.0622 44.9347 0.0522 12.6429 12.8897 2.6789 4.1739 10.0279 98.5221
temp: 298.150 k
press: 1.00000 atm
elementType: 8 8 8 7 6 6 6 6 6 6 6 6 1 1 1 1 1 1 1
symmnumber: 1
zpe: 358917.7 jmol-1
zpe.correction: 0.136705 hartree
zpe.thermalcorrener: 0.147146 hartree
zpe.thermalcorrenthalpy: 0.148090 hartree
zpe.thermalcorrgfe: 0.099669 hartree
zpe.sumelectzpe: -588.512150 hartree
zpe.sumelectthermal: -588.501709 hartree
zpe.sumelectthermalent: -588.500765 hartree
zpe.sumelectthermalfe: -588.549185 hartree
dipole: 7.7685 1.1523 0.0033
dipole: 7.8535
quadrupole: -86.5403 -63.1537 -71.9945
quadrupole: 9.8824 0.0121 0.0049
quadrupole: -12.6441 10.7425 1.9017 9.8824 0.0121 0.0049
hfenergy: -588.6488545 hartree
pointgroup: C01 [X(C8H7N1O3)]
dipole: 3.0535151 0.4663646 0.0742183 debye
dipolederiv: -1.9785608 0.1097897 -0.012641 0.1908192 -0.0829205 0.026562 -0.0065357 0.0254571 -0.4139649 -1.031089 -0.2653216 -0.0288307 -0.3451267 -0.6303098 -0.0310174 -0.0339945 -0.0298347 -0.2548573 -0.7400839 0.1225905 0.0019845 0.5292598 -0.7541893 -0.0286262 0.030301 -0.0341401 -0.2456735 2.4070959 0.0979158 0.0360741 -0.4788684 1.0735266 0.0553809 -0.0041385 0.0629048 0.1970879 -0.954216 0.0066038 -0.0119428 0.1764402 -0.1437672 -0.0075435 -0.0005069 -0.0097701 -0.0058196 0.5593201 0.031385 0.0112018 0.2420292 0.1143243 0.0203424 0.0256144 0.0175736 -0.125098 0.411579 -0.0346624 0.0044783 -0.3254159 0.1062233 0.0112851 -0.0156508 0.0150454 -0.1097571 -0.5572996 0.0683395 0.0000719 0.6406834 -0.0569725 0.0179479 0.0409446 0.0104898 -0.1902066 -0.6342164 -0.016658 -0.0074811 -0.4710975 0.0424769 0.0081499 -0.0401855 0.0141554 -0.1574428 1.8666845 -0.0845097 0.0172166 -0.1930908 0.1686523 0.0021094 0.0095967 0.0035838 0.1017948 1.5171975 0.0176172 0.0216118 0.3598868 0.0551892 0.0116164 0.0459375 0.0072607 -0.0443873 -1.5948935 0.0000064 -0.0187808 -0.3947668 0.055931 0.0092304 -0.0469889 0.0144655 -0.1552782 0.0626396 0.0848184 0.0048165 0.0478643 -0.0368781 -0.0128986 0.0022054 -0.0124049 0.1521863 0.0373439 -0.1011409 -0.0086518 -0.0552717 -0.007473 -0.011516 -0.0053166 -0.0121502 0.1427096 -0.0534677 -0.101384 -0.0102591 -0.0941886 -0.0047845 -0.014218 -0.0097231 -0.0143281 0.1765547 0.053287 0.0542883 0.0023049 0.0642069 -0.0090553 -0.0121619 0.0029206 -0.0123333 0.1726287 0.0979649 0.0097564 -0.0002448 0.0319628 0.0137078 -0.0100162 0.001851 -0.0103837 0.1632824 0.0406278 0.0201361 -0.0007813 0.0828892 0.0217688 -0.0114914 0.0033106 -0.0123439 0.2039694 0.4900867 -0.0195706 -0.0001471 -0.0082154 0.0745502 -0.0231354 0.0003588 -0.0232472 0.3922716 unknown
polarizability: 246.2058839|10.2357569|107.7024706|3.4175468|4.8976012|40.6412237 unknown
InChI: InChI=1S/C8H7NO3/c10-8-3-1-7(2-4-8)5-6-9(11)12/h1-6,10H
charge 0 multiplicity 1
19 atoms
O  4.497165 -0.344563 0.0423
O  -4.393225 -1.052952 -0.123332
O  -3.844295 1.166536 0.039014
N  -3.525947 -0.08841 -0.044654
C  0.299401 0.22846 0.027864
C  1.16987 1.353701 0.119298
C  0.888968 -1.071631 -0.056828
C  2.567096 1.201244 0.126877
C  2.279364 -1.238379 -0.050479
C  3.122268 -0.100345 0.041568
C  -1.140073 0.461691 0.025081
C  -2.125266 -0.481613 -0.053218
H  0.738212 2.359058 0.185194
H  0.251629 -1.959095 -0.128619
H  3.217862 2.081465 0.198059
H  2.739031 -2.228504 -0.115083
H  -1.484207 1.503384 0.09277
H  -2.002303 -1.562617 -0.125925
H  5.016749 0.49547 0.109913
