program: Gaussian 09
title: 000232618
version: EM64L-G09RevD.01
frameworkgroup: C1[X(C13H27N)]
method: RPBEPBE
basis: SDD
operation: Freq
keyword: #pfreq=noraman
keyword: PBEPBE/SDD
title: #p freq=noraman PBEPBE/SDD
converged: YES YES NO NO
title: Mulliken charges:
elementType: N C C C C C C C C C C C C C H H H H H H H H H H H H H H H H H H H H H H H H H H H
charge: -0.303886 0.074526 -0.447423 -0.459202 -0.506172 -0.402564 -0.405328 -0.381688 -0.057987 -0.726132 -0.353379 -0.363669 -0.342865 -0.690664 0.223057 0.184084 0.192346 0.205920 0.182214 0.187373 0.194366 0.191773 0.191912 0.192224 0.191640 0.195696 0.184740 0.210155 0.229745 0.221023 0.200903 0.215556 0.170735 0.198744 0.209756 0.175239 0.190782 0.191971 0.214640 0.208388 0.211453
chargesum: 0.00000
title: Mulliken charges with hydrogens summed into heavy atoms:
elementType: N C C C C C C C C C C C C C
charge: -0.074141 0.297583 -0.070993 -0.071068 -0.124433 -0.018879 -0.021464 -0.001251 0.152168 -0.088650 0.016099 0.021325 0.039887 -0.056183
polarizability: 1.66254856e+02 -7.44348237e-01 1.45078737e+02 -2.22039964e+00 -2.15825676e-01 1.28191989e+02
1716.lowfreq: -26.6080 -8.9935 -7.0029 -0.0006 0.0003 0.0004 24.5217 30.3296 40.1411
frequency: 23.2654 27.1877 39.4605 64.4866 86.5864 111.8020 113.4015 140.6498 156.9182 219.6545 219.8501 229.9164 238.2811 253.6794 280.1902 312.0244 358.0448 392.6227 420.0341 432.3263 451.6141 464.3210 525.2804 552.9896 653.2761 735.5941 767.8186 783.4219 800.3284 824.4806 839.3597 855.8955 888.5357 896.6491 905.8598 913.8027 924.8482 935.2283 968.9996 1014.3214 1021.4383 1039.5118 1047.4687 1057.3997 1074.6728 1078.5509 1098.4129 1101.4199 1112.6648 1117.4187 1130.5468 1148.0075 1172.5915 1191.4929 1205.8929 1229.1543 1243.3344 1255.1930 1258.7142 1271.2144 1273.9340 1278.8710 1283.4250 1292.3504 1312.9978 1326.2892 1333.0994 1334.3861 1338.9872 1342.7179 1347.0835 1351.4563 1361.0657 1372.4922 1379.0187 1390.5722 1438.4292 1453.8231 1458.9461 1460.5339 1462.9905 1465.4510 1466.9261 1470.4631 1473.1879 1474.7188 1475.8616 1478.0538 1485.2524 1493.9589 2854.1526 2936.4129 2942.4662 2946.4477 2956.9473 2960.5327 2961.7926 2964.2644 2964.6457 2966.2761 2970.1837 2972.7163 2979.3318 2990.9019 3001.1337 3005.9667 3011.8862 3020.6064 3022.1212 3024.1410 3036.9324 3039.8068 3060.2034 3069.3812 3069.7238 3071.8034 3409.3283
redmass: 3.3401 2.4715 1.7843 3.0526 2.9785 2.0523 2.6128 2.4965 2.5631 1.3020 1.4090 2.6671 1.1411 2.6647 3.1914 1.7604 2.8424 2.6715 2.0588 2.9703 2.2769 1.9483 2.8923 1.8866 1.5903 1.0737 2.3891 1.5083 1.1630 1.5142 2.3859 1.8218 1.7642 1.5360 1.5728 1.7672 1.7604 1.1982 2.2531 2.6837 2.3052 2.0804 1.7846 1.0888 2.0822 1.7623 1.6631 2.0442 2.4472 2.4772 1.9885 2.2272 2.2120 1.7710 1.4958 1.4804 1.2593 1.3068 1.2809 1.2652 1.2847 1.1801 1.1037 1.3196 1.2774 1.2780 1.3990 1.4099 1.5465 1.4740 1.4830 1.4960 1.4640 1.2833 1.3338 1.2259 1.1577 1.1089 1.0876 1.0887 1.0898 1.0693 1.0807 1.0699 1.0739 1.0832 1.0706 1.0430 1.0676 1.0903 1.0702 1.0613 1.0634 1.0636 1.0633 1.0594 1.0639 1.0491 1.0523 1.0608 1.0810 1.0362 1.0827 1.0842 1.0973 1.0982 1.0958 1.0978 1.0969 1.1004 1.1032 1.1015 1.0990 1.0992 1.1006 1.0994 1.0735
irintensity: 0.0674 0.0744 0.2091 0.3163 0.1221 0.7306 0.2072 1.0753 0.7538 0.2351 0.0456 0.8838 0.1527 0.8093 0.4335 0.0958 1.1463 2.3085 0.7328 0.1159 0.9869 3.6415 5.3028 4.8139 89.5999 10.4251 0.4418 0.0895 0.5627 2.5973 10.5237 3.9001 14.5086 2.2698 5.6707 4.9915 0.1520 3.6122 12.0701 3.3922 5.6203 1.9892 0.5679 0.1862 1.1222 7.9297 3.0761 0.7831 3.5431 3.0517 23.7090 52.7516 18.7606 0.2757 2.7489 1.7444 4.7905 1.4764 1.2529 5.0853 0.2589 1.6411 0.4540 2.7654 4.2826 10.1457 1.2436 1.1100 1.2437 1.1595 7.4778 3.6414 1.2602 15.6622 9.5734 7.9127 27.8562 4.4529 1.9659 7.9651 8.8012 0.6557 20.1186 1.1531 4.0273 4.0283 6.5171 13.9130 10.2755 8.6011 109.0987 18.5572 22.2670 54.8092 5.1263 33.3357 35.3196 66.4272 1.2492 64.5544 5.6593 37.7436 26.4775 34.5756 11.4533 2.2826 117.3437 93.2706 30.7427 1.9749 155.2968 47.4437 60.1793 54.7293 82.7836 56.7163 2.0838
temp: 298.150 k
press: 1.00000 atm
elementType: 7 6 6 6 6 6 6 6 6 6 6 6 6 6 1 1 1 1 1 1 1 1 1 1 1 1 1 1 1 1 1 1 1 1 1 1 1 1 1 1 1
symmnumber: 1
zpe: 991498.2 jmol-1
zpe.correction: 0.377642 hartree
zpe.thermalcorrener: 0.394694 hartree
zpe.thermalcorrenthalpy: 0.395639 hartree
zpe.thermalcorrgfe: 0.331201 hartree
zpe.sumelectzpe: -565.153895 hartree
zpe.sumelectthermal: -565.136842 hartree
zpe.sumelectthermalent: -565.135898 hartree
zpe.sumelectthermalfe: -565.200336 hartree
dipole: -0.7074 0.6907 -0.1305
dipole: 0.9973
quadrupole: -90.5603 -91.3816 -89.4229
quadrupole: -0.0165 0.7209 -0.6449
quadrupole: -0.1054 -0.9267 1.0320 -0.0165 0.7209 -0.6449
hfenergy: -565.5315366 hartree
pointgroup: C01 [X(C13H27N1)]
dipole: -0.2813228 -0.2718464 0.030115 debye
polarizability: 166.2995404|0.3090276|144.981235|1.9824529|1.2015551|128.2448071 unknown
InChI: InChI=1S/C13H27N/c1-3-4-10-14-12(2)11-13-8-6-5-7-9-13/h12-14H,3-11H2,1-2H3
charge 0 multiplicity 1
41 atoms
N  -1.268825 -0.781157 0.273784
C  1.724587 -0.281317 0.248443
C  3.039111 -0.365641 1.067227
C  2.00652 0.315966 -1.154933
C  1.045224 -1.670667 0.173528
C  3.768506 0.995825 1.155954
C  2.733933 1.679543 -1.070149
C  4.04224 1.575815 -0.252247
C  -0.36398 -1.69491 -0.470908
C  -0.884676 -3.15606 -0.576351
C  -2.580835 -0.48899 -0.343251
C  -3.324733 0.6156 0.433989
C  -4.70269 0.959724 -0.17609
C  -5.442523 2.068608 0.6027
H  1.022159 0.403473 0.768396
H  3.715174 -1.108653 0.590642
H  2.819799 -0.745458 2.085899
H  1.058737 0.440051 -1.7133
H  2.633101 -0.398597 -1.732366
H  0.963263 -2.08729 1.202336
H  1.698788 -2.368914 -0.390806
H  3.138911 1.710524 1.725908
H  4.71705 0.88523 1.71767
H  2.94762 2.060772 -2.0883
H  2.061482 2.418231 -0.586233
H  4.526093 2.569135 -0.172297
H  4.754575 0.912679 -0.786713
H  -0.289358 -1.286513 -1.499507
H  -1.369621 -1.077233 1.256722
H  -1.897808 -3.192542 -1.01699
H  -0.92794 -3.626497 0.425726
H  -0.218216 -3.771049 -1.210379
H  -3.249994 -1.383168 -0.42347
H  -2.393717 -0.143611 -1.380457
H  -2.68493 1.518965 0.463885
H  -3.463974 0.293234 1.488345
H  -5.330963 0.045783 -0.206139
H  -4.565287 1.276939 -1.23023
H  -6.423019 2.298663 0.146532
H  -5.620199 1.765042 1.651791
H  -4.849783 3.002564 0.620636
