program: Gaussian 09
title: 000232605
version: EM64L-G09RevD.01
frameworkgroup: C1[X(C13H13NO3)]
method: RPBEPBE
basis: SDD
operation: Freq
keyword: #p
keyword: freq=noraman
keyword: PBEPBE/SDD
title: #p freq=noraman PBEPBE/SDD
converged: YES YES NO NO
title: Mulliken charges:
elementType: O O O N C C C C C C C C C C C C C H H H H H H H H H H H H H
charge: -0.279415 -0.264404 -0.262473 -0.438195 0.278028 0.179339 -0.472436 0.355481 0.226580 0.133565 -0.393911 -0.452679 -0.342600 -0.806902 0.166691 -0.220299 -0.671671 0.314305 0.314780 0.232638 0.252966 0.275880 0.240110 0.240146 0.262082 0.228422 0.228241 0.209475 0.233169 0.233087
chargesum: 0.00000
title: Mulliken charges with hydrogens summed into heavy atoms:
elementType: O O O N C C C C C C C C C C C C C
charge: -0.279415 -0.264404 -0.262473 -0.123890 0.278028 0.179339 -0.157656 0.355481 0.226580 0.133565 -0.161273 -0.199712 -0.066720 -0.064565 0.166691 0.236364 0.004060
polarizability: 2.53621571e+02 -3.40798457e+00 1.77033949e+02 -1.43451331e-01 -1.24560269e-01 7.64599753e+01
1716.lowfreq: -8.2326 -7.0809 -5.6049 -0.0005 0.0003 0.0005 23.5283 48.6760 68.5670
frequency: 23.4131 48.6590 68.5554 72.6073 93.6214 105.3739 157.6237 174.7142 182.7671 192.7351 246.2188 249.8279 292.7945 313.4862 332.5305 353.9150 430.8926 442.8956 488.9035 512.1601 528.1917 542.8618 577.0128 579.8985 596.0392 662.6795 663.3327 740.0391 753.7424 779.5119 798.2549 816.7318 838.6735 839.6057 862.7454 897.7299 978.3435 979.4588 990.3671 1009.6532 1021.8062 1049.4651 1065.6770 1086.3754 1113.6212 1135.9033 1143.2257 1177.0613 1225.3167 1247.9499 1249.9806 1282.1628 1286.1170 1352.1609 1360.6992 1390.4701 1402.2930 1404.7364 1421.1721 1457.7832 1463.2481 1468.1479 1473.0046 1484.9672 1488.2643 1494.1790 1551.1782 1590.6313 1607.7436 1619.1232 1647.3944 2977.8764 2996.5652 3007.9921 3052.6932 3066.6889 3092.9184 3108.9133 3118.1773 3122.6480 3164.3301 3173.3249 3180.2190 3543.0789
redmass: 3.1360 2.9877 7.3437 4.2181 1.0885 2.7874 4.7216 3.5269 4.9846 3.1859 1.3212 4.3196 8.2890 3.6219 5.1943 4.2538 3.3096 5.6561 5.4431 6.2855 3.7424 6.4915 2.7601 5.2155 1.4013 6.6243 4.0909 4.4672 6.8866 3.1640 1.1033 4.1398 4.1217 1.5973 1.5527 5.1139 3.9659 1.4573 1.3521 1.6120 2.2707 1.5205 2.5980 4.0760 2.2222 1.4686 1.5900 1.7204 2.3651 1.6494 1.1323 3.1263 2.0965 2.0116 1.5518 3.5670 1.2785 1.3603 5.3846 1.3029 1.0398 1.0437 1.0622 1.5598 1.5899 2.8074 8.2347 4.9352 7.8058 7.8319 5.9827 1.0396 1.0361 1.0579 1.0979 1.1068 1.0984 1.1024 1.0964 1.0899 1.0950 1.0923 1.0926 1.0773
irintensity: 4.1901 3.3077 1.5216 2.8134 0.0041 0.7192 0.1064 2.9453 3.6942 0.7018 1.1611 4.8257 2.2659 2.2352 1.4667 14.8500 2.7066 2.8072 10.0351 3.3644 5.2350 0.4848 27.0061 5.3980 47.5024 2.3871 2.8019 35.9629 1.2421 0.0931 2.0713 1.8251 7.8587 36.9280 37.9413 15.2450 3.8877 10.1564 0.5248 0.7930 33.8807 9.4580 145.3035 218.1388 1.8747 5.6859 31.2179 2.4225 346.8906 0.0252 0.0032 136.7362 1.0592 7.3903 10.2763 27.7902 26.4098 26.7349 4.5772 96.3726 12.1598 18.4434 6.3570 47.5542 3.4025 209.3400 123.1099 2.9604 83.8424 229.8127 245.6076 26.5385 20.2313 24.3923 15.6295 10.5363 32.5362 41.5617 8.9381 12.4589 3.9234 5.0962 3.9327 47.1755
temp: 298.150 k
press: 1.00000 atm
elementType: 8 8 8 7 6 6 6 6 6 6 6 6 6 6 6 6 6 1 1 1 1 1 1 1 1 1 1 1 1 1
symmnumber: 1
zpe: 613599.7 jmol-1
zpe.correction: 0.233708 hartree
zpe.thermalcorrener: 0.249633 hartree
zpe.thermalcorrenthalpy: 0.250577 hartree
zpe.thermalcorrgfe: 0.189102 hartree
zpe.sumelectzpe: -782.420009 hartree
zpe.sumelectthermal: -782.404084 hartree
zpe.sumelectthermalent: -782.403140 hartree
zpe.sumelectthermalfe: -782.464615 hartree
dipole: -4.4219 -3.6188 0.0300
dipole: 5.7140
quadrupole: -63.1941 -107.7418 -100.9663
quadrupole: 20.0676 -0.0309 -0.0019
quadrupole: 27.4399 -17.1077 -10.3322 20.0676 -0.0309 -0.0019
hfenergy: -782.6537169 hartree
pointgroup: C01 [X(C13H13N1O3)]
dipole: 1.6914912 1.4793662 0.0640471 debye
polarizability: 253.7597296|-0.8870096|176.7878861|0.7754697|3.2384781|76.5678792 unknown
InChI: InChI=1S/C13H13NO3/c1-3-17-13(16)9-4-5-11-10(7-9)12(15)6-8(2)14-11/h4-7,14H,3H2,1-2H3
charge 0 multiplicity 1
30 atoms
O  -3.241256 -0.514108 -0.147191
O  1.220881 -2.739429 -0.205671
O  -3.451691 1.807514 -0.078544
N  2.98676 1.012487 -0.070849
C  1.589453 0.951611 -0.080541
C  0.951354 -0.326546 -0.12603
C  -0.462372 -0.385435 -0.13481
C  3.793491 -0.126379 -0.104067
C  -1.234503 0.792933 -0.099724
C  1.762949 -1.581926 -0.163802
C  0.812658 2.144802 -0.045341
C  3.2134 -1.381258 -0.149244
C  -0.583022 2.06201 -0.05509
C  5.284083 0.12093 -0.087067
C  -2.723939 0.780413 -0.106706
C  -4.731237 -0.62248 -0.154361
C  -5.062723 -2.1106 -0.187755
H  3.431585 1.931636 -0.037532
H  -0.935171 -1.371159 -0.169689
H  1.308498 3.122511 -0.010504
H  3.847415 -2.270971 -0.175507
H  -1.203946 2.963266 -0.02855
H  5.593353 0.66259 0.827449
H  5.604099 0.721641 -0.960072
H  5.830156 -0.8337 -0.115219
H  -5.119789 -0.119449 0.749774
H  -5.113811 -0.081189 -1.038797
H  -6.159539 -2.247895 -0.194379
H  -4.646597 -2.587374 -1.091417
H  -4.65244 -2.626049 0.697136
