program: Gaussian 09
title: 000232594
version: EM64L-G09RevD.01
frameworkgroup: C1[X(C9H11ClO)]
method: RPBEPBE
basis: SDD
operation: Freq
keyword: #p
keyword: freq=noraman
keyword: PBEPBE/SDD
title: #p freq=noraman PBEPBE/SDD
converged: YES YES NO NO
title: Mulliken charges:
elementType: Cl O C C C C C C C C C H H H H H H H H H H H
charge: -0.061977 -0.444043 0.175994 0.394620 -0.674996 -0.686304 -0.367573 -0.392662 -0.237473 -0.223114 -0.240204 0.255887 0.290636 0.214817 0.228619 0.251536 0.218297 0.275107 0.341250 0.225425 0.226671 0.229487
chargesum: 0.00000
title: Mulliken charges with hydrogens summed into heavy atoms:
elementType: Cl O C C C C C C C C C
charge: -0.061977 -0.102793 0.175994 0.394620 -0.128473 0.008668 -0.149276 -0.117555 -0.012048 0.003557 -0.010717
polarizability: 1.21334038e+02 8.27363510e+00 9.79324470e+01 7.21961285e+00 -8.93764249e+00 9.05547567e+01
1716.lowfreq: -16.4086 -0.0041 -0.0035 -0.0035 3.6958 6.5367 19.2502 68.3465 134.9019
frequency: 17.8407 68.1590 134.8885 170.8300 197.3681 224.2023 276.1906 318.9213 335.8827 399.3074 402.2937 430.9095 487.9491 532.5657 560.2277 616.2610 683.4225 705.5152 708.5505 772.2165 832.5018 854.3263 920.2877 925.5085 938.3461 980.6052 990.1007 999.0163 1016.4708 1031.5303 1067.1940 1081.0387 1125.5165 1171.7100 1181.0781 1192.2057 1249.7279 1275.5808 1312.4113 1316.3991 1379.7998 1382.1808 1432.3114 1439.4907 1455.3704 1470.2878 1483.4797 1592.4819 1612.6807 2995.8833 3065.8133 3099.2976 3108.2652 3122.9151 3130.2425 3142.8535 3149.7394 3153.8586 3165.8822 3501.9232
redmass: 4.1342 7.7813 3.6127 3.4519 1.2074 3.3133 3.2575 3.6309 3.6239 2.4497 3.4643 1.2882 2.9692 4.0298 3.3419 6.4129 5.5487 1.8152 4.3352 1.9298 2.8165 1.2531 1.7168 1.4603 1.5955 1.4019 5.6731 1.3306 3.0075 2.2093 1.4462 1.5379 1.7675 1.0799 1.9398 1.1378 1.3998 1.9981 1.5209 1.3495 4.7973 1.3444 1.7476 1.2919 1.0651 1.0858 2.0448 6.1553 6.0684 1.0346 1.0567 1.1012 1.1000 1.0845 1.0878 1.0936 1.1089 1.0957 1.1011 1.0650
irintensity: 0.2878 0.8153 1.2383 2.1836 0.0280 2.9745 0.3100 2.4596 0.6944 16.5911 3.1001 122.4406 31.3185 18.4831 50.2372 0.0554 14.4110 58.2218 3.7026 44.5432 8.8683 0.3431 12.5860 8.7246 10.8280 0.5542 0.2753 1.7213 23.9704 30.1186 22.2871 10.2426 2.4307 0.4065 6.9445 1.5337 31.3128 36.0954 54.5524 7.1691 3.1157 16.6960 2.7086 27.6778 7.8493 6.3191 14.0056 0.6106 2.5016 16.4860 15.3603 27.1706 12.8392 3.6614 5.3727 31.3976 4.0127 27.6603 18.0699 10.9486
temp: 298.150 k
press: 1.00000 atm
elementType: 17 8 6 6 6 6 6 6 6 6 6 1 1 1 1 1 1 1 1 1 1 1
symmnumber: 1
zpe: 462893.9 jmol-1
zpe.correction: 0.176307 hartree
zpe.thermalcorrener: 0.187218 hartree
zpe.thermalcorrenthalpy: 0.188162 hartree
zpe.thermalcorrgfe: 0.138501 hartree
zpe.sumelectzpe: -884.014077 hartree
zpe.sumelectthermal: -884.003166 hartree
zpe.sumelectthermalent: -884.002222 hartree
zpe.sumelectthermalfe: -884.051883 hartree
dipole: -0.6888 0.2168 1.7391
dipole: 1.8831
quadrupole: -68.8988 -76.6970 -68.3642
quadrupole: 2.3774 4.7510 -1.6513
quadrupole: 2.4212 -5.3770 2.9558 2.3774 4.7510 -1.6513
hfenergy: -884.190384 hartree
pointgroup: C01 [X(C9H11Cl1O1)]
dipole: -0.2433306 -0.6034382 -0.354305 debye
dipolederiv: -0.2071455 -0.0137898 0.0346891 -0.0676461 -0.5753526 0.1502662 0.0483318 0.0979381 -0.2507156 -0.7605927 -0.1275261 -0.0351386 -0.1327198 -0.345805 -0.1649485 -0.0296509 -0.1609608 -0.5899435 0.6384134 0.1404181 0.0063469 0.1551296 0.2343544 0.1668281 0.059282 0.0456579 0.4108994 0.0984268 -0.0620113 -0.0117275 -0.0969278 -0.0933297 0.0065334 0.0257853 -0.0035706 -0.112337 0.0714322 -0.0091414 0.022105 0.0449343 0.7010232 -0.1430096 -0.0378852 -0.1728261 0.1059896 -0.0952466 -0.0229538 0.0493088 -0.0263069 -0.0627295 0.0000139 0.0184562 0.185971 -0.0341676 -0.1055004 0.0029801 -0.0754455 0.0256937 -0.1271118 -0.0007535 -0.0696383 0.0070148 0.0452395 -0.1436014 -0.007336 0.0767476 0.0198047 -0.14903 0.0015124 0.0387568 0.0012746 0.0146453 -0.0211491 -0.0166554 0.0700275 -0.0138131 -0.1414813 0.0097631 0.0961823 0.0125228 0.0845443 0.00719 -0.0241766 -0.0856433 -0.0267603 -0.1392728 0.0323836 -0.0805121 0.0334278 0.0960543 0.0828125 -0.0290688 0.010634 -0.0273393 -0.1608065 0.0079267 -0.0090935 0.0051553 -0.0750599 0.1230204 -0.0275891 -0.0825608 -0.0268229 -0.0542469 -0.0396772 -0.0433565 -0.0364354 -0.0553267 -0.0918412 0.0284078 0.0161221 0.0221357 -0.0315411 0.0287724 -0.0269485 0.028404 0.0990866 0.0763919 -0.0391657 -0.0752591 -0.0422726 0.0450233 -0.0544661 -0.06302 -0.116009 -0.0415597 -0.177412 0.0728112 -0.0156651 0.0726104 0.0663177 -0.0031862 -0.0111729 -0.0038092 0.1174817 0.0773667 -0.0300508 0.0894902 -0.0482595 0.0340571 0.0393903 0.0795549 0.0741336 -0.0264716 0.0370151 0.0282374 0.1078258 0.0142384 0.1280725 -0.0241479 0.1113339 -0.015335 -0.0538659 0.1021645 0.005145 -0.0768784 0.0062023 0.1432991 -0.0036283 -0.062877 -0.0037207 -0.004483 0.3907071 0.0791219 -0.0253987 0.0877664 0.0690803 0.0356864 -0.0389259 0.0642048 0.3263843 0.0194196 0.0042959 -0.084744 0.0079102 0.1531601 -0.0086901 -0.1025278 -0.0097685 -0.0765712 0.0137341 0.0190885 0.0888775 0.0186282 0.1491417 -0.0306207 0.1030134 -0.028901 -0.0704278 -0.1356053 0.0289589 -0.0037134 0.0338144 0.1571779 -0.0059484 -0.0050879 -0.0043684 0.0906045 unknown
polarizability: 123.8013355|-5.1794948|82.4821116|-1.6586461|-1.49844|103.5377944 unknown
InChI: InChI=1S/C9H11ClO/c1-9(11,7-10)8-5-3-2-4-6-8/h2-6,11H,7H2,1H3
charge 0 multiplicity 1
22 atoms
Cl 2.019961 1.997955 -1.33792
O  1.975189 0.27108 1.318559
C  1.415668 -0.372741 0.112487
C  -0.107468 -0.145809 0.027149
C  2.200535 0.12124 -1.117052
C  1.719592 -1.87882 0.305053
C  -0.815883 -0.177334 -1.200009
C  -0.836539 0.03128 1.230526
C  -2.221073 -0.030384 -1.224203
C  -2.240888 0.178061 1.20803
C  -2.940023 0.147256 -0.020395
H  1.86404 -0.320024 -2.06582
H  3.277886 -0.039567 -0.967209
H  1.326977 -2.474781 -0.536838
H  2.806922 -2.043607 0.402872
H  1.231708 -2.221652 1.232287
H  -0.28369 -0.303477 -2.149572
H  -0.287492 0.058195 2.177548
H  1.909921 1.255649 1.190202
H  -2.752464 -0.049173 -2.182413
H  -2.788145 0.317037 2.147352
H  -4.029433 0.263112 -0.040233
