program: Gaussian 09
title: 000232591
version: EM64L-G09RevD.01
frameworkgroup: C1[X(C10H12O3)]
method: RPBEPBE
basis: SDD
operation: Freq
keyword: #pfreq=noraman
keyword: PBEPBE/SDD
title: #p freq=noraman PBEPBE/SDD
converged: YES YES NO NO
title: Mulliken charges:
elementType: O O O C C C C C C C C C C H H H H H H H H H H H H
charge: -0.286677 -0.284446 -0.434249 0.298602 -0.411207 -0.679318 0.199430 0.203857 -0.339353 -0.358992 -0.358280 -0.214836 -0.214495 0.230861 0.202303 0.242310 0.231321 0.227400 0.243839 0.213659 0.248933 0.250165 0.228571 0.228822 0.331783
chargesum: 0.00000
title: Mulliken charges with hydrogens summed into heavy atoms:
elementType: O O O C C C C C C C C C C
charge: -0.286677 -0.284446 -0.102466 0.298602 0.021957 0.021712 0.199430 0.203857 0.118145 -0.110060 -0.108114 0.013735 0.014326
polarizability: 1.50341944e+02 -2.12789431e+01 8.48583557e+01 -1.36223811e+00 6.20848044e-01 1.06720345e+02
1716.lowfreq: -10.9258 -7.8056 0.0008 0.0009 0.0010 9.5021 29.8011 62.2498 76.0905
frequency: 29.1799 62.2375 76.0831 151.6853 165.8530 199.5734 249.2071 262.6660 307.5413 328.6530 333.0063 337.7133 415.6644 461.6205 513.2644 547.5946 549.2018 593.2276 646.7757 705.1731 727.8662 732.5581 744.4516 805.6064 808.3924 838.4631 844.5408 915.1219 929.5056 959.7552 961.5497 1004.0123 1007.8349 1045.4091 1052.6986 1092.1523 1125.9245 1138.9787 1162.7815 1195.5699 1225.6822 1242.3542 1272.1150 1284.6460 1302.1934 1348.0139 1382.5822 1386.4548 1409.6733 1441.4279 1444.0893 1458.9937 1460.8122 1465.1415 1484.8816 1604.5987 1625.3643 2994.0140 2996.9434 3001.0305 3061.8660 3104.9659 3106.6835 3110.2101 3140.4350 3158.2851 3175.1088 3182.5087 3559.4117
redmass: 5.8738 1.9683 3.7745 4.1348 2.9986 1.0560 4.8103 3.2692 1.3472 3.9586 3.3212 3.5504 3.0419 3.1036 5.1456 4.9187 4.1695 7.4848 5.2378 4.8989 7.1399 3.9325 1.2293 5.9297 1.4507 4.7659 1.3369 1.3757 1.7984 1.2838 3.7231 1.4439 2.0270 2.2375 3.7992 1.5522 1.7645 2.4198 1.1011 2.1654 2.8825 3.0936 1.4230 1.2964 1.3313 1.3505 1.3463 1.2324 4.9597 1.0806 2.4596 1.0661 1.0478 3.4932 1.0810 7.8829 7.9279 1.0638 1.0592 1.0412 1.0977 1.1004 1.1000 1.0994 1.0859 1.0918 1.0951 1.0993 1.0663
irintensity: 1.1784 6.3997 1.4217 2.8167 0.2959 0.4990 2.4834 12.1670 72.2832 4.2969 51.1259 18.2112 5.0822 0.0949 1.1430 9.4494 0.2151 0.0980 1.3149 2.7856 10.0110 8.9690 113.8869 82.9412 12.7908 7.4361 0.1522 6.7569 21.5315 0.0046 85.3209 3.4008 18.8061 0.4385 50.6265 35.6467 58.8085 67.0118 18.8096 13.0619 312.8974 27.8127 1.1332 23.9677 25.5394 5.8380 29.9189 19.4631 9.0823 5.8042 3.6087 2.0096 10.0001 196.9929 6.7326 1.4322 3.3500 14.8748 31.6057 24.1361 7.8131 14.3714 12.2037 22.4434 2.1231 18.3339 10.9365 6.0232 7.3195
temp: 298.150 k
press: 1.00000 atm
elementType: 8 8 8 6 6 6 6 6 6 6 6 6 6 1 1 1 1 1 1 1 1 1 1 1 1
symmnumber: 1
zpe: 523124.5 jmol-1
zpe.correction: 0.199248 hartree
zpe.thermalcorrener: 0.211579 hartree
zpe.thermalcorrenthalpy: 0.212523 hartree
zpe.thermalcorrgfe: 0.160144 hartree
zpe.sumelectzpe: -612.937465 hartree
zpe.sumelectthermal: -612.925133 hartree
zpe.sumelectthermalent: -612.924189 hartree
zpe.sumelectthermalfe: -612.976568 hartree
dipole: 0.3795 1.7561 1.4169
dipole: 2.2881
quadrupole: -71.7011 -79.6407 -74.3803
quadrupole: -9.1329 -6.6633 -2.7705
quadrupole: 3.5396 -4.4000 0.8604 -9.1329 -6.6633 -2.7705
hfenergy: -613.1367124 hartree
pointgroup: C01 [X(C10H12O3)]
dipole: -0.1039796 -0.6902623 0.5684442 debye
dipolederiv: -1.4832312 0.3290433 -0.0178051 0.2959337 -0.4498759 -0.0105171 -0.0960284 -0.0085965 -0.4138982 -1.4777701 0.3302565 0.0065599 0.3049957 -0.4448807 0.0092014 0.0914244 0.0088493 -0.4071894 -0.7756029 -0.2011998 0.0600289 -0.2520665 -0.7175039 -0.1502817 0.0348361 -0.1531734 -0.1505307 1.420588 -0.1590572 0.0053327 -0.2903962 0.8973432 -0.000496 0.0006958 0.0010576 0.4588035 -0.1580265 -0.0468766 -0.0018226 -0.157636 -0.2644573 -0.0155482 0.0255065 0.0058366 0.1090756 -0.1038488 -0.0522996 -0.0006618 0.073782 -0.3161888 -0.0013409 0.003 0.0007183 0.0540992 0.9669228 -0.2409311 0.0968703 -0.2215845 0.082202 -0.0301545 0.7509065 -0.2169288 0.0465173 0.9723091 -0.2452101 -0.0931595 -0.2324188 0.0855377 0.0284753 -0.7443426 0.2158727 0.0405514 0.5628627 0.130988 -0.0009955 0.2940948 0.5011065 0.0567041 0.0159215 0.0668701 0.2256753 -0.1042568 -0.0246539 -0.0546197 -0.0184562 -0.1581321 0.0178716 0.0191024 -0.0068401 0.0773855 -0.1072556 -0.0228564 0.0542564 -0.0163018 -0.1566934 -0.0173791 -0.0217137 0.0080357 0.078707 -0.0344797 -0.0380274 0.0195788 -0.0428258 -0.1688922 -0.008529 -0.1020402 0.0333858 -0.0057534 -0.0329421 -0.0387092 -0.0198157 -0.0433006 -0.1677678 0.009423 0.1020394 -0.0326194 -0.0041089 0.0167855 0.0566369 0.0556796 0.0105964 0.0358151 -0.0577138 0.0966467 -0.0660136 -0.0108656 0.0036357 0.0378519 -0.0655389 -0.0116609 0.0382064 0.0500205 -0.1284661 0.0585193 -0.05579 -0.0689158 -0.1023329 0.0016252 -0.0895102 0.0354548 -0.0001271 0.0015469 0.0010815 0.0963671 0.041218 0.0438363 0.0836128 0.0466455 0.0664745 -0.0082208 0.110407 -0.0551893 -0.0292286 0.0358919 0.044391 -0.0872806 0.0465026 0.0662522 0.0078753 -0.1153292 0.055292 -0.0307932 0.03234 0.0163829 -0.0595311 0.0353984 0.0517794 0.0288446 -0.0905244 0.0462479 -0.0292033 -0.0653797 0.0254061 0.0819949 0.0304203 0.0023108 -0.0398788 0.1326418 -0.0637348 -0.0490836 0.1058181 0.0197591 -0.0201497 0.0227013 0.1690241 0.005132 -0.0026333 0.0002569 -0.0597449 0.1066635 0.0199849 0.0204919 0.022594 0.1688723 -0.006377 0.0033013 -0.0015328 -0.0561716 -0.0643537 0.0637049 0.0842623 0.0658547 0.1500343 -0.0232789 0.0846828 -0.0237814 0.0397144 -0.0633463 0.0629863 -0.0847941 0.0653069 0.150213 0.0228409 -0.0849903 0.0233107 0.0392812 0.2743739 -0.0090738 -0.0641192 0.0613312 0.3437658 0.133454 -0.086591 0.1030757 0.0361839 unknown
polarizability: 152.8501628|-16.7698636|82.3365738|1.7067448|-0.155566|106.7339074 unknown
InChI: InChI=1S/C10H12O3/c1-10(6-7-11)12-8-4-2-3-5-9(8)13-10/h2-5,11H,6-7H2,1H3
charge 0 multiplicity 1
25 atoms
O  0.425319 -0.470944 1.220071
O  0.427017 -0.480772 -1.186604
O  3.660506 2.13453 -0.071388
C  1.249717 -0.883458 0.017017
C  2.559459 -0.093518 0.01878
C  1.395831 -2.402419 0.02288
C  -0.857615 -0.144821 0.721098
C  -0.8561 -0.14978 -0.692045
C  2.365738 1.434455 -0.046791
C  -1.999968 0.180226 1.457593
C  -1.996142 0.171518 -1.433651
C  -3.170971 0.506177 0.716616
C  -3.168981 0.502063 -0.697792
H  3.169859 -0.416697 -0.844514
H  3.113126 -0.367767 0.938864
H  0.400711 -2.878358 0.032801
H  1.938006 -2.734655 -0.878796
H  1.952475 -2.728394 0.918173
H  1.879374 1.717356 -0.992372
H  1.738142 1.780157 0.798403
H  -1.989229 0.18414 2.550757
H  -1.981617 0.169361 -2.526708
H  -4.088181 0.763395 1.256345
H  -4.084548 0.756476 -1.241604
H  4.116069 2.001629 0.798167
