program: Gaussian 09
title: 000232587
version: EM64L-G09RevD.01
frameworkgroup: C1[X(C13H7N3O5)]
method: RPBEPBE
basis: SDD
operation: Freq
keyword: #p
keyword: freq=noraman
keyword: PBEPBE/SDD
title: #p freq=noraman PBEPBE/SDD
converged: NO NO NO NO
title: Mulliken charges:
elementType: O O O O O N N N C C C C C C C C C C C C C H H H H H H H
charge: -0.215749 -0.155978 -0.155983 -0.193751 -0.179634 -0.493088 0.006826 0.020526 0.014709 0.381841 0.199248 0.250655 0.094428 0.347021 -0.619895 0.483586 -0.546741 -0.347649 -0.381010 -0.254655 -0.203373 0.328184 0.296448 0.315734 0.286263 0.238383 0.243742 0.239911
chargesum: 0.00000
title: Mulliken charges with hydrogens summed into heavy atoms:
elementType: O O O O O N N N C C C C C C C C C C C C C
charge: -0.215749 -0.155978 -0.155983 -0.193751 -0.179634 -0.164904 0.006826 0.020526 0.014709 0.381841 0.199248 0.250655 0.094428 0.347021 -0.323447 0.483586 -0.231007 -0.061387 -0.142627 -0.010913 0.036538
polarizability: 3.09385607e+02 -9.62337329e+00 2.17306466e+02 1.02609568e-02 1.47177385e-02 8.28847761e+01
1716.lowfreq: -0.0010 -0.0004 0.0000 5.7907 7.1205 9.9265 25.6377 52.9064 63.1869
frequency: 25.5401 52.8980 63.1687 91.9196 119.0991 129.3351 141.5048 142.1423 198.5832 255.7044 262.2883 277.8122 287.5389 309.4310 323.0966 361.6173 421.9862 440.7043 479.6178 505.6242 523.0517 531.3064 550.8490 590.3620 611.0758 633.4166 641.2629 661.9104 668.5080 690.7334 708.7878 711.8459 739.8941 742.8037 774.6465 815.1283 860.6872 867.1178 879.5753 897.7864 920.1246 926.5714 974.2107 992.1355 1004.8793 1033.3996 1083.0911 1109.3756 1154.7322 1176.0700 1184.4900 1206.2978 1231.2163 1249.1711 1267.8905 1289.5729 1305.1730 1370.6776 1390.8302 1394.9479 1406.3920 1426.5039 1441.1077 1460.7536 1479.8842 1516.5952 1545.5051 1590.3052 1593.6012 1622.3253 1631.0591 3124.2059 3148.1429 3159.7759 3165.9518 3175.9582 3193.5665 3545.0684
redmass: 12.8441 7.5328 10.9467 8.2042 8.8788 8.9184 13.6134 5.8092 6.1973 7.8280 6.0312 10.0274 4.2810 11.6249 9.2854 6.4241 8.5795 3.6619 8.2031 9.6424 4.9047 3.3177 8.3759 6.3487 1.4294 8.6818 4.0661 3.1694 8.2793 9.2664 6.8246 5.0229 4.6075 11.4409 1.4391 4.4212 6.8937 7.7205 1.5427 1.4430 1.6329 7.5368 1.3693 7.1638 1.3404 2.1067 1.9461 2.0761 2.9822 1.0850 1.7090 10.9715 5.1010 1.7682 3.2632 2.6412 2.3724 4.0681 7.2205 14.6439 9.6761 4.0973 3.4637 3.2829 2.8335 3.4395 11.0852 6.9142 5.3556 5.4136 8.1461 1.0891 1.0888 1.0936 1.0926 1.1003 1.0934 1.0773
irintensity: 0.9374 0.1953 0.9404 0.0373 4.7549 1.0888 4.9020 0.0773 1.3716 0.0828 0.3726 4.1515 1.2424 4.2756 15.3209 1.4526 18.5130 0.9392 1.5474 4.2114 0.1795 20.7332 1.8287 1.8351 42.0358 1.0875 18.6518 8.9804 9.1129 27.2415 12.6326 15.2168 0.0012 25.3722 103.9731 3.3191 18.9991 21.8063 0.5495 1.6405 59.1653 7.4471 2.9529 2.8810 0.2816 3.5364 15.8325 14.9061 28.4466 2.7815 4.8285 301.4959 67.1693 4.7013 26.5944 9.6820 39.9106 49.1139 72.9360 166.4114 39.7552 14.4610 18.8090 121.0412 39.8080 156.9342 131.2516 37.0984 30.0107 219.6979 44.6764 5.7581 8.3595 3.8887 6.1782 22.3108 20.5392 49.2976
temp: 298.150 k
press: 1.00000 atm
elementType: 8 8 8 8 8 7 7 7 6 6 6 6 6 6 6 6 6 6 6 6 6 1 1 1 1 1 1 1
symmnumber: 1
zpe: 487370.1 jmol-1
zpe.correction: 0.185629 hartree
zpe.thermalcorrener: 0.201882 hartree
zpe.thermalcorrenthalpy: 0.202827 hartree
zpe.thermalcorrgfe: 0.140716 hartree
zpe.sumelectzpe: -1038.365715 hartree
zpe.sumelectthermal: -1038.349462 hartree
zpe.sumelectthermalent: -1038.348518 hartree
zpe.sumelectthermalfe: -1038.410628 hartree
dipole: 6.1025 -7.2727 -0.0004
dipole: 9.4938
quadrupole: -118.0351 -129.1021 -123.9810
quadrupole: -14.1627 -0.0020 -0.0018
quadrupole: 5.6710 -5.3961 -0.2749 -14.1627 -0.0020 -0.0018
hfenergy: -1038.5513442 hartree
pointgroup: C01 [X(C13H7N3O5)]
dipole: 2.4133411 -2.8508166 -0.000149 debye
polarizability: 309.4676217|-9.2222943|217.2244506|0.0101968|0.0147623|82.8847761 unknown
InChI: InChI=1S/C13H7N3O5/c17-13-8-3-1-2-4-9(8)14-10-5-7(15(18)19)6-11(12(10)13)16(20)21/h1-6,14H
charge 0 multiplicity 1
28 atoms
O  1.352668 2.361237 0.000358
O  -1.366172 3.222381 1.146262
O  -1.36633 3.222646 -1.14548
O  -3.924589 -2.847125 -0.000505
O  -4.969707 -0.816062 -0.000152
N  0.989349 -1.778097 -0.000111
N  -1.302944 2.646318 0.00032
N  -3.91665 -1.556924 -0.000193
C  -0.079205 0.418692 0.000082
C  -0.172119 -1.014564 -0.000068
C  2.428895 0.195169 0.000157
C  2.275916 -1.225051 0.000014
C  1.249967 1.091531 0.00014
C  -1.298426 1.147835 0.000146
C  -1.436605 -1.662349 -0.000161
C  -2.590116 -0.871905 -0.000098
C  -2.558677 0.541304 0.000056
C  3.738668 0.746288 0.000303
C  3.4187 -2.070134 0.000007
C  4.868055 -0.085949 0.0003
C  4.701943 -1.499816 0.000149
H  0.900037 -2.796024 -0.000211
H  -1.532262 -2.752071 -0.000273
H  -3.488344 1.114157 0.0001
H  3.825175 1.837616 0.000409
H  3.296021 -3.160035 -0.000103
H  5.873612 0.345434 0.000411
H  5.581441 -2.152502 0.000146
