program: Gaussian 09
title: 000232576
version: EM64L-G09RevD.01
frameworkgroup: C1[X(C10H19Cl3O2)]
method: RPBEPBE
basis: SDD
operation: Freq
keyword: #p
keyword: freq=noraman
keyword: PBEPBE/SDD
title: #p freq=noraman PBEPBE/SDD
converged: YES YES NO NO
title: Mulliken charges:
elementType: Cl Cl Cl O O C C C C C C C C C C H H H H H H H H H H H H H H H H H H H
charge: 0.082463 0.113451 0.113184 -0.261174 -0.272257 0.059920 0.074069 0.168394 -0.365627 -0.368716 -0.721784 -0.718414 -0.635658 -0.701369 -0.707330 0.183739 0.185352 0.235375 0.210100 0.221401 0.244295 0.210413 0.232428 0.229585 0.218553 0.229659 0.226527 0.211932 0.208481 0.221032 0.227680 0.200488 0.219182 0.224627
chargesum: 0.00000
title: Mulliken charges with hydrogens summed into heavy atoms:
elementType: Cl Cl Cl O O C C C C C C C C C C
charge: 0.082463 0.113451 0.113184 -0.261174 -0.272257 0.243660 0.259421 0.403769 0.065874 0.085992 -0.041218 -0.050297 -0.635658 -0.044176 -0.063033
polarizability: 1.62157875e+02 8.31958680e+00 1.50952590e+02 3.77910340e+00 -6.76005628e+00 1.30505787e+02
1716.lowfreq: -10.5788 -9.3926 -0.0012 -0.0011 -0.0002 6.1099 21.2264 31.9515 38.6038
frequency: 19.6965 31.9063 38.5015 53.4098 60.1313 71.9040 81.2066 113.8169 138.9995 167.4936 194.1553 198.8264 207.4301 207.9112 215.3405 220.9335 238.3900 257.0087 270.2083 280.2525 288.9776 322.8615 355.5307 396.6416 408.1321 439.0465 448.0496 487.0516 599.8430 608.4943 708.5745 722.7168 769.2332 774.7759 801.8729 823.0016 853.7460 875.4592 953.5352 957.8337 971.9837 980.1056 981.1156 1005.2103 1028.2175 1035.4106 1055.1601 1086.1531 1087.2720 1155.7629 1159.6704 1172.0614 1174.8763 1252.1839 1253.2106 1278.1546 1286.2506 1300.0378 1324.9104 1327.2122 1338.7750 1345.1377 1357.0759 1385.0629 1388.5243 1391.2524 1394.0733 1459.3080 1460.9572 1463.1708 1464.7193 1476.3947 1478.8244 1479.8974 1482.8218 1488.3813 1488.6441 2940.9118 2948.5508 2972.3078 2980.1659 2982.2448 2993.9448 2994.0527 2995.8975 3004.9953 3047.5196 3054.1224 3072.8060 3076.2244 3085.3184 3086.0109 3095.1233 3095.5163 3098.0688 3099.4306
redmass: 4.3686 6.8412 3.2157 4.0597 2.3423 2.5199 2.6159 3.5313 5.0258 5.8528 1.6097 1.4990 4.5230 1.0718 3.2651 1.6683 3.2572 3.8757 2.0959 2.7203 6.3506 3.0924 12.2474 3.2190 2.5019 4.1981 3.0241 3.1668 5.7417 4.9182 7.3256 5.5366 1.6582 1.3665 1.7190 2.0889 2.2906 2.9559 1.2341 1.2495 3.7783 1.7617 2.0994 4.9728 2.8241 2.8511 4.4325 1.8606 2.0654 1.9572 2.0178 1.9845 1.9787 1.2586 1.2524 1.1427 1.1763 1.2201 1.3143 1.3705 1.4320 1.4523 1.3005 1.2564 1.2669 1.2061 1.2046 1.0546 1.0578 1.0506 1.0560 1.0456 1.0440 1.0661 1.0668 1.0538 1.0520 1.0836 1.0843 1.0380 1.0366 1.0808 1.0453 1.0501 1.0373 1.0633 1.1002 1.0967 1.1001 1.0993 1.1003 1.1005 1.0994 1.0997 1.1003 1.0993
irintensity: 0.5827 0.0278 0.1199 0.2953 0.0769 0.1548 0.5390 0.0936 0.3872 0.0923 0.7097 0.1626 2.0597 0.2040 1.7444 0.3803 3.8155 0.9239 3.3392 1.6779 0.5713 2.3104 1.3864 1.5240 0.7458 8.7741 3.4926 2.9255 59.4998 7.0762 120.0161 89.5700 22.6793 27.6420 9.3650 24.2479 17.5412 30.6379 10.3666 8.6030 213.7880 32.8056 109.3336 98.1221 13.1466 20.0966 69.7533 22.6699 70.9411 8.3930 8.7099 7.6551 0.2623 6.2437 0.9926 3.7945 18.5066 1.6411 15.2653 9.8058 17.6062 1.7965 5.1135 15.6967 22.5563 23.2996 26.5533 3.5221 2.2044 17.3705 2.8651 7.5300 18.1403 11.2757 8.0685 7.4771 10.1780 35.7529 31.8438 28.4284 32.3660 31.0607 12.9600 33.3828 8.2095 26.5690 2.6297 14.1012 40.4911 45.6820 33.6775 65.4447 24.5079 34.2007 29.6077 27.0872
temp: 298.150 k
press: 1.00000 atm
elementType: 17 17 17 8 8 6 6 6 6 6 6 6 6 6 6 1 1 1 1 1 1 1 1 1 1 1 1 1 1 1 1 1 1 1
symmnumber: 1
zpe: 721013.8 jmol-1
zpe.correction: 0.274620 hartree
zpe.thermalcorrener: 0.294660 hartree
zpe.thermalcorrenthalpy: 0.295604 hartree
zpe.thermalcorrgfe: 0.223832 hartree
zpe.sumelectzpe: -1921.817181 hartree
zpe.sumelectthermal: -1921.797140 hartree
zpe.sumelectthermalent: -1921.796196 hartree
zpe.sumelectthermalfe: -1921.867968 hartree
dipole: -1.1509 4.2758 1.0351
dipole: 4.5474
quadrupole: -110.0146 -111.0070 -113.8162
quadrupole: 3.1402 1.4652 1.7189
quadrupole: 1.5980 0.6056 -2.2036 3.1402 1.4652 1.7189
hfenergy: -1922.0918004 hartree
pointgroup: C01 [X(C10H19Cl3O2)]
dipole: 1.3267972 -0.9839827 0.6871487 debye
polarizability: 151.1758346|6.4752116|162.9492885|-7.075545|-2.5954613|129.4911285 unknown
InChI: InChI=1S/C10H19Cl3O2/c1-5-7(3)14-9(10(11,12)13)15-8(4)6-2/h7-9H,5-6H2,1-4H3
charge 0 multiplicity 1
34 atoms
Cl -3.042626 -0.918994 -0.565505
Cl -1.548541 1.217272 -2.109896
Cl -2.863663 1.878176 0.535019
O  0.094259 -0.783278 -0.392222
O  0.088962 1.425503 0.618947
C  0.689269 -1.924932 0.391901
C  1.57574 1.464326 0.429916
C  -0.63332 0.189433 0.368076
C  -0.373602 -3.009241 0.658669
C  1.923009 1.776676 -1.040599
C  1.868234 -2.403835 -0.460862
C  2.04875 2.530492 1.426837
C  -1.930363 0.581387 -0.417826
C  0.157673 -4.167369 1.533656
C  3.444515 1.788953 -1.312769
H  1.055733 -1.522511 1.362596
H  2.004164 0.478116 0.702118
H  -0.969971 -0.229732 1.343071
H  -1.246155 -2.54605 1.158371
H  -0.738246 -3.3915 -0.313208
H  1.438715 1.015059 -1.676445
H  1.476419 2.753638 -1.307014
H  1.505105 -2.782042 -1.432635
H  2.572158 -1.576103 -0.654822
H  2.415738 -3.214463 0.050274
H  1.603459 3.509547 1.176957
H  1.743041 2.264648 2.453154
H  3.148479 2.626349 1.402151
H  0.576085 -3.793082 2.487751
H  0.94724 -4.743917 1.019679
H  -0.658467 -4.869163 1.781059
H  3.916507 0.837416 -0.997468
H  3.956119 2.612347 -0.782493
H  3.642179 1.914476 -2.392536
