program: Gaussian 09
title: 000232548
version: EM64L-G09RevD.01
frameworkgroup: C1[X(C15H17N)]
method: RPBEPBE
basis: SDD
operation: Freq
keyword: #pfreq=noraman
keyword: PBEPBE/SDD
title: #p freq=noraman PBEPBE/SDD
converged: YES YES NO NO
title: Mulliken charges:
elementType: N C C C C C C C C C C C C C C C H H H H H H H H H H H H H H H H H
charge: -0.181716 -0.425449 -0.406093 -0.389323 -0.392129 -0.403466 0.332562 0.142838 -0.385884 0.415531 -0.363801 -0.252545 -0.472849 -0.433853 -0.264921 -0.246225 0.203089 0.254606 0.234635 0.178146 0.197312 0.202006 0.207726 0.194565 0.218394 0.190845 0.242147 0.262205 0.219867 0.236403 0.235349 0.224671 0.225355
chargesum: 0.00000
title: Mulliken charges with hydrogens summed into heavy atoms:
elementType: N C C C C C C C C C C C C C C C
charge: -0.181716 0.032246 0.006688 0.009994 0.010162 0.005773 0.332562 0.142838 -0.143737 0.415531 -0.101595 -0.032678 -0.236446 -0.198504 -0.040249 -0.020870
polarizability: 2.25310554e+02 -7.37547658e+00 1.94956615e+02 2.22804837e+00 6.48983695e+00 9.38556569e+01
1716.lowfreq: -9.6150 -7.4236 -0.0005 -0.0004 -0.0001 10.9656 61.5183 69.5139 84.8854
frequency: 61.3904 69.4115 84.8834 166.8355 184.0309 212.4963 255.0200 271.0690 296.6574 315.0814 388.6879 437.5384 439.1488 454.4313 474.4145 476.1624 521.0259 532.4315 582.0846 612.4050 654.2041 685.2865 742.8682 777.0155 784.8194 793.5092 806.8751 810.6921 843.4718 857.5509 868.3094 893.7266 909.0208 917.8410 956.9495 963.0536 973.7990 989.4307 1003.8896 1026.3929 1042.5869 1063.5727 1084.3648 1095.1281 1123.2248 1136.8126 1149.3120 1150.2357 1169.7186 1188.6532 1216.1938 1235.4311 1236.0850 1259.4626 1267.2996 1271.0565 1332.2342 1335.0184 1341.6876 1348.9027 1352.9433 1369.8771 1372.7631 1406.9739 1416.1230 1439.0900 1451.4247 1454.9802 1459.6185 1469.0118 1473.7304 1483.4903 1515.7385 1583.1236 1592.1494 1627.8239 2860.8073 2879.0562 2968.6661 2983.7648 2985.9497 3035.0680 3043.3353 3046.4417 3054.5488 3075.1058 3118.8369 3121.6207 3130.4821 3141.2541 3148.2570 3158.5892 3162.5284
redmass: 3.4202 3.3111 4.0136 3.9597 3.4190 2.6473 2.4435 4.1840 2.8237 3.0963 1.9006 3.1528 3.0259 3.8362 2.9490 2.7912 4.4219 4.1567 3.2622 3.5363 3.2530 4.1191 1.3449 2.3546 2.9802 4.3110 1.6547 1.6426 2.5954 1.5127 1.4922 1.5862 3.2839 2.5744 1.3358 1.3195 1.3714 1.3282 2.8589 2.4222 2.1247 2.1009 1.4846 2.0685 3.0101 2.0079 1.4359 1.2242 1.0835 1.2566 2.0345 1.6143 1.8336 1.3379 1.4745 1.1915 1.2833 1.8098 1.4238 1.4836 1.4315 2.8874 1.4015 2.5457 7.0597 2.3073 1.1331 2.2101 1.0964 1.1317 1.0871 1.1051 3.9147 6.2111 5.9043 6.6285 1.0703 1.0722 1.0628 1.0611 1.0612 1.0963 1.0966 1.0960 1.1029 1.0892 1.0856 1.0853 1.0888 1.0927 1.0942 1.0975 1.0996
irintensity: 0.4017 1.1588 0.0947 3.1417 0.9682 2.8919 1.8348 0.9838 0.5603 1.7489 3.1356 7.9253 0.1367 7.3626 1.6671 1.8361 0.5799 1.0786 4.6002 2.8569 2.2252 3.3408 1.4589 47.4759 40.0702 1.9622 41.7362 21.4775 1.9332 17.6240 4.7852 2.1992 21.3690 8.0890 3.5295 1.8063 5.0910 0.6847 32.8157 5.5584 4.1262 7.2808 7.9793 48.8790 8.5530 1.9017 0.8590 5.9140 2.2487 1.1123 12.1740 48.8113 37.3246 5.5213 16.8763 10.8048 2.4611 15.5934 0.7646 1.3976 4.0248 25.2352 25.0845 28.4549 20.6182 12.7602 13.5606 57.4762 13.1430 11.0197 1.5409 8.5996 23.9518 84.0752 3.1780 3.0152 77.2854 101.6817 40.3691 31.0327 39.8602 75.9238 47.6578 0.9462 93.3728 14.9065 1.7468 2.5085 8.9406 27.3901 35.6519 35.7588 21.2320
temp: 298.150 k
press: 1.00000 atm
elementType: 7 6 6 6 6 6 6 6 6 6 6 6 6 6 6 6 1 1 1 1 1 1 1 1 1 1 1 1 1 1 1 1 1
symmnumber: 1
zpe: 738838.0 jmol-1
zpe.correction: 0.281409 hartree
zpe.thermalcorrener: 0.294246 hartree
zpe.thermalcorrenthalpy: 0.295190 hartree
zpe.thermalcorrgfe: 0.242364 hartree
zpe.sumelectzpe: -635.395223 hartree
zpe.sumelectthermal: -635.382386 hartree
zpe.sumelectthermalent: -635.381442 hartree
zpe.sumelectthermalfe: -635.434268 hartree
dipole: -1.7088 -0.0251 0.4198
dipole: 1.7598
quadrupole: -85.2298 -87.9207 -99.9879
quadrupole: -0.8913 0.2349 0.6327
quadrupole: 5.8164 3.1254 -8.9418 -0.8913 0.2349 0.6327
hfenergy: -635.6766317 hartree
pointgroup: C01 [X(C15H17N1)]
dipole: 0.6838221 0.0710627 -0.0819658 debye
polarizability: 223.1974802|1.014233|174.8918275|16.4740769|41.0601994|116.0335184 unknown
InChI: InChI=1S/C15H17N/c1-4-11-16(12-5-1)15-10-6-8-13-7-2-3-9-14(13)15/h2-3,6-10H,1,4-5,11-12H2
charge 0 multiplicity 1
33 atoms
N  1.402008 0.133076 0.307058
C  1.970705 -0.050933 -1.060762
C  2.403826 0.669651 1.256064
C  3.165707 -1.023608 -1.035815
C  3.61785 -0.280471 1.34831
C  4.243452 -0.52893 -0.04342
C  0.064609 0.627727 0.391935
C  -1.027851 -0.189793 -0.11214
C  -0.234077 1.870981 0.981606
C  -2.374212 0.347661 -0.105661
C  -0.832348 -1.535028 -0.568502
C  -1.571651 2.366177 1.027156
C  -2.622769 1.638977 0.467862
C  -3.443356 -0.44737 -0.639519
C  -1.896644 -2.293162 -1.064914
C  -3.21244 -1.736455 -1.123993
H  2.311853 0.937421 -1.45691
H  1.180066 -0.413617 -1.736432
H  1.928344 0.773105 2.247569
H  2.759581 1.68396 0.94324
H  3.586951 -1.113487 -2.055622
H  2.809685 -2.027149 -0.730114
H  3.281627 -1.242357 1.781445
H  4.366269 0.154072 2.038976
H  5.070979 -1.259355 0.030201
H  4.680818 0.417885 -0.423363
H  0.572202 2.494549 1.380031
H  0.164429 -1.978141 -0.477328
H  -1.760487 3.345302 1.482078
H  -3.645184 2.03388 0.474094
H  -4.456103 -0.026253 -0.646349
H  -1.728362 -3.324704 -1.393968
H  -4.039473 -2.332814 -1.525212
