program: Gaussian 09
title: 000232613
version: EM64L-G09RevD.01
frameworkgroup: C1[X(C15H23NO4)]
method: RPBEPBE
basis: SDD
operation: Freq
keyword: #p
keyword: freq=noraman
keyword: PBEPBE/SDD
title: #p freq=noraman PBEPBE/SDD
converged: YES YES NO NO
title: Mulliken charges:
elementType: O O O O N C C C C C C C C C C C C C C C H H H H H H H H H H H H H H H H H H H H H H H
charge: -0.249082 -0.278433 -0.278682 -0.250659 -0.092092 -0.329218 -0.334974 -0.345730 -0.423053 -0.323300 -0.317626 -0.268594 0.110611 0.257253 0.229236 -0.369151 -0.362868 -0.237702 -0.534500 -0.538341 0.236206 0.184067 0.192300 0.205855 0.207748 0.186765 0.207658 0.217164 0.211601 0.189907 0.209462 0.190145 0.239268 0.185057 0.239545 0.241895 0.220620 0.225408 0.243200 0.219103 0.244351 0.217432 0.222146
chargesum: 0.00000
title: Mulliken charges with hydrogens summed into heavy atoms:
elementType: O O O O N C C C C C C C C C C C C C C C
charge: -0.249082 -0.278433 -0.278682 -0.250659 -0.092092 0.091055 0.063181 0.048783 0.001770 0.078207 0.081981 0.155731 0.110611 0.257253 0.229236 -0.129605 -0.120973 -0.017082 0.153212 0.145588
polarizability: 2.30116348e+02 8.70464745e+00 2.02651245e+02 1.75656155e-01 -2.61425039e+00 1.26162035e+02
1716.lowfreq: -18.4819 -3.2995 -0.0008 -0.0005 0.0002 1.3706 6.1730 15.0569 22.6585
frequency: -13.8067 14.6185 22.4539 56.6050 60.1745 81.6569 100.4575 103.5483 118.6841 163.3116 188.0709 193.0586 207.2900 233.4840 238.8120 242.5349 253.3506 281.3623 315.3457 325.0802 346.3892 352.9314 355.8565 372.8060 402.4995 466.8665 477.4299 509.5540 523.3948 563.8615 585.0723 596.1318 604.8629 668.2327 722.4330 743.3081 762.9875 773.1289 805.6646 811.5658 833.0322 839.8966 854.4666 882.4386 893.1550 913.4632 934.7099 986.8778 1004.2610 1026.3967 1028.4643 1051.8764 1069.4466 1073.7959 1086.0504 1090.0832 1096.8436 1109.9662 1111.8209 1112.7660 1128.2134 1147.3526 1150.0014 1155.0273 1187.9187 1189.1795 1191.0816 1200.4583 1220.8494 1233.0967 1250.4315 1266.3306 1268.7035 1290.1732 1299.9517 1319.8543 1331.8625 1346.2553 1358.2529 1364.1029 1371.2450 1383.6546 1393.2254 1427.0615 1437.6064 1443.0624 1445.2148 1450.5898 1451.9783 1457.0210 1457.9045 1465.2008 1466.8722 1466.9580 1474.0839 1480.2864 1484.0070 1485.7376 1580.6476 1600.7960 2853.3297 2865.9192 2910.1112 2951.0881 2955.2626 2957.1638 2961.1460 2966.6048 2996.6418 3002.2108 3021.0654 3041.7012 3044.6437 3049.9826 3052.2324 3061.7000 3076.1540 3079.8865 3123.1591 3123.4787 3137.9859 3165.5505 3176.4499
redmass: 3.7211 3.6434 4.5378 3.7510 3.4318 4.2518 4.1873 3.8132 2.7616 4.0331 3.2412 1.6790 2.4580 2.4378 1.8936 1.5821 2.1051 1.7030 2.3552 4.2850 4.0295 4.1394 3.7066 3.6549 2.0675 2.8085 5.4971 6.4467 4.0289 3.8599 4.6990 3.9240 1.9940 4.2695 1.7358 1.9741 3.5086 2.9655 3.7714 2.2533 1.4245 1.6042 6.5047 2.2966 3.6708 1.8745 1.2892 9.3096 2.5875 2.5520 2.1235 2.1523 2.4759 5.8571 2.0315 2.2409 2.7496 1.2605 1.2753 2.3913 2.5435 1.4078 1.7760 1.6672 1.0769 2.8318 1.1974 1.3576 1.3487 1.8714 1.3766 1.8668 1.9646 1.2310 1.2173 1.2886 1.2676 1.2865 1.3593 1.4562 1.2707 9.4284 1.4747 1.3167 1.1968 1.0834 1.0831 1.0949 1.0817 1.8609 1.1003 1.7424 1.0536 1.0547 1.0736 1.2217 1.1675 1.2081 6.3389 7.4673 1.0705 1.0698 1.0660 1.0664 1.0665 1.0331 1.0329 1.0623 1.0603 1.0929 1.0890 1.0891 1.1037 1.1039 1.0997 1.1030 1.0962 1.0976 1.0992 1.0996 1.0866 1.0909 1.0972
irintensity: 0.0709 0.0377 0.2047 3.6760 1.9127 10.9335 2.5771 0.1693 0.6698 1.9875 1.4978 0.1724 10.3453 0.0951 2.2123 0.0726 1.3558 0.0532 12.2452 7.8836 0.4240 1.3120 3.9732 7.7570 2.7480 0.9549 0.3240 2.3912 1.9453 1.3860 1.5028 7.9894 5.3948 10.9367 44.5477 13.2459 4.5841 42.8868 21.7906 5.0802 0.0910 0.5344 2.5809 4.1201 36.2067 8.5152 0.7740 15.9827 27.4255 49.6251 2.2347 24.3916 25.8451 268.9769 43.8262 32.2585 25.5193 0.2095 0.2908 4.3399 72.7911 4.8555 4.6154 30.4752 3.1295 78.5379 25.3818 17.9533 18.3773 107.7014 18.3765 46.8624 32.1640 0.8272 16.0546 1.4395 2.7427 7.3098 14.8662 8.7596 3.9087 1.5164 4.4141 43.2029 18.1348 2.6941 2.4456 25.3256 0.3778 119.7568 5.6138 84.7012 3.5117 22.5791 28.8711 27.4489 4.2441 9.6747 2.3983 106.1622 55.9306 90.3625 58.6162 32.3827 118.5203 72.3731 69.0097 41.1954 19.2149 14.6673 52.1773 35.9193 46.1833 44.4765 35.6574 54.0682 45.9970 36.5442 22.5785 22.5296 5.8504 15.2796 15.1721
temp: 298.150 k
press: 1.00000 atm
elementType: 8 8 8 8 7 6 6 6 6 6 6 6 6 6 6 6 6 6 6 6 1 1 1 1 1 1 1 1 1 1 1 1 1 1 1 1 1 1 1 1 1 1 1
symmnumber: 1
zpe: 947085.9 jmol-1
zpe.correction: 0.360726 hartree
zpe.thermalcorrener: 0.380637 hartree
zpe.thermalcorrenthalpy: 0.381582 hartree
zpe.thermalcorrgfe: 0.310679 hartree
zpe.sumelectzpe: -939.391399 hartree
zpe.sumelectthermal: -939.371488 hartree
zpe.sumelectthermalent: -939.370543 hartree
zpe.sumelectthermalfe: -939.441446 hartree
dipole: -4.4926 0.1608 -1.7117
dipole: 4.8103
quadrupole: -120.4078 -99.9740 -120.4678
quadrupole: 2.2965 -4.3537 -1.9714
quadrupole: -6.7913 13.6425 -6.8513 2.2965 -4.3537 -1.9714
hfenergy: -939.752125 hartree
pointgroup: C01 [X(C15H23N1O4)]
dipole: 1.7707082 0.2412177 0.6229013 debye
polarizability: 231.0099929|-7.1477106|201.3164622|-0.6999846|-6.2343474|126.6031726 unknown
InChI: InChI=1S/C15H23NO4/c1-17-13-5-3-6-14(18-2)15(13)20-10-4-7-16-8-11-19-12-9-16/h3,5-6H,4,7-12H2,1-2H3
charge 0 multiplicity 1
43 atoms
O  -6.015164 -0.119061 -0.540262
O  0.899142 -0.453904 -0.249543
O  3.234428 -1.930069 0.083993
O  0.939785 2.228658 -0.430888
N  -3.345146 -0.535567 0.555609
C  -1.898574 -0.251981 0.762123
C  -3.668558 -0.881517 -0.854194
C  -4.199933 0.597617 0.997066
C  -1.031601 -1.526831 0.734071
C  -5.159147 -1.233369 -0.983189
C  -5.684732 0.227215 0.852512
C  0.452943 -1.224669 0.946397
C  2.144681 0.181679 -0.176182
C  3.368348 -0.535813 -0.046711
C  2.188656 1.598501 -0.326016
C  4.611208 0.144582 -0.065969
C  3.432299 2.279911 -0.359347
C  4.628615 1.545314 -0.227003
C  4.465208 -2.72312 0.116555
C  0.940139 3.677452 -0.64434
H  -1.501113 0.475537 0.015263
H  -1.794752 0.219228 1.760079
H  -3.428708 -0.032615 -1.544107
H  -3.065366 -1.752106 -1.169353
H  -3.979802 0.819633 2.059035
H  -3.996809 1.525009 0.402138
H  -1.377823 -2.220996 1.524213
H  -1.135002 -2.053124 -0.233023
H  -5.435804 -1.415591 -2.035069
H  -5.380139 -2.13744 -0.375129
H  -6.336377 1.079935 1.106914
H  -5.917333 -0.633593 1.516622
H  1.055029 -2.147829 1.023251
H  0.615398 -0.605781 1.853425
H  5.552132 -0.403294 0.032845
H  3.472544 3.36585 -0.478614
H  5.588559 2.072298 -0.248271
H  5.064352 -2.570306 -0.801702
H  4.129913 -3.769368 0.171545
H  5.079774 -2.481979 1.005816
H  -0.121867 3.953506 -0.720654
H  1.404209 4.213708 0.206835
H  1.46419 3.94719 -1.581939
