program: Gaussian 09
title: 000232536
version: EM64L-G09RevD.01
frameworkgroup: C1[X(C12H16O2)]
method: RPBEPBE
basis: SDD
operation: Freq
keyword: #pfreq=noraman
keyword: PBEPBE/SDD
title: #p freq=noraman PBEPBE/SDD
converged: YES YES NO NO
title: Mulliken charges:
elementType: O O C C C C C C C C C C C C H H H H H H H H H H H H H H H H
charge: -0.414729 -0.230653 0.215662 -0.558245 0.333858 0.334855 0.482274 -0.615336 -0.624741 -0.514130 -0.846678 -0.846822 -0.816042 0.183124 0.238487 0.238333 0.265930 0.266078 0.233529 0.233761 0.223872 0.235526 0.233736 0.235443 0.223950 0.233900 0.222769 0.222972 0.233745 0.375571
chargesum: 0.00000
title: Mulliken charges with hydrogens summed into heavy atoms:
elementType: O O C C C C C C C C C C C C
charge: -0.039158 -0.230653 0.215662 -0.081425 0.333858 0.334855 0.482274 -0.381806 -0.390980 0.017879 -0.153544 -0.153528 -0.136556 0.183124
polarizability: 1.77254609e+02 -9.63440416e-02 1.34803567e+02 1.10733796e+01 -8.51066480e-03 9.36043927e+01
1716.lowfreq: -32.5124 -7.3776 -0.0007 -0.0007 0.0004 8.1926 11.1089 18.2866 37.2334
frequency: -31.6907 13.6134 37.1943 50.4410 115.3318 140.6909 147.2845 148.3357 177.6042 191.1728 228.3456 268.7268 303.1711 337.0395 346.7136 446.1412 478.4518 489.2375 501.2309 523.5377 540.3611 562.1607 570.9504 590.2381 638.5888 739.8398 770.2407 774.9871 863.6163 881.6626 894.0988 911.3614 957.0635 993.7197 1013.2434 1015.8306 1018.6268 1039.0312 1041.3416 1049.0449 1060.9841 1077.2985 1151.2663 1161.8834 1219.1830 1240.3771 1258.0353 1283.0159 1305.1727 1315.7034 1368.0863 1368.8686 1396.1165 1399.4747 1400.1443 1415.2013 1437.2813 1445.0484 1472.6616 1473.2781 1474.9830 1475.0198 1481.2926 1485.2934 1501.4589 1590.2551 1621.9057 1665.8644 2970.7664 2971.5921 2973.0092 3001.6921 3022.4387 3044.2367 3045.0234 3045.3091 3053.5472 3076.3499 3081.0354 3081.8344 3082.3565 3109.0502 3113.5171 3510.8827
redmass: 1.0203 10.0797 4.2017 4.2195 2.1367 3.6564 1.0860 1.1402 3.8976 3.2449 2.6698 2.5121 2.7936 2.2751 4.5687 4.2553 4.9837 2.6296 1.8616 3.0138 3.8140 4.1535 3.8466 3.5802 1.3106 3.2162 4.2471 1.4188 1.3804 3.4772 1.3156 2.5314 3.4594 1.4649 1.7977 3.1667 1.4822 1.6037 1.5352 1.6120 2.2288 2.4751 2.4791 1.2491 1.7355 1.4553 1.3777 1.1617 1.7385 5.9154 1.7519 4.9686 1.2284 1.3006 1.2423 2.5027 1.0998 1.5251 1.0594 1.0548 1.0566 1.0595 1.1784 1.4534 1.2844 6.8514 6.0584 8.2131 1.0379 1.0379 1.0384 1.0612 1.0603 1.0970 1.0968 1.0979 1.0951 1.1014 1.0980 1.0997 1.0990 1.0908 1.0917 1.0639
irintensity: 0.5442 0.9079 0.0419 0.2231 0.2447 0.9218 0.0551 2.7363 4.5269 2.5406 0.0042 0.6668 0.1955 0.1651 0.5042 15.7933 20.9086 2.8334 21.5545 0.0561 3.2048 1.0616 5.5198 24.9992 125.0111 2.2801 4.3698 12.1659 17.8664 1.3110 0.0144 1.4721 0.8678 0.1186 42.1420 155.5423 3.2799 22.9368 0.1082 7.5324 0.0015 118.9211 2.1013 1.7343 0.3975 0.5056 0.0725 0.6130 52.7557 1.3287 43.5366 0.9025 12.3720 19.1310 2.9492 1.3928 15.6406 5.7589 4.5691 5.8341 21.9146 18.7485 33.6522 33.0640 13.1914 10.2536 16.9746 216.3381 46.5012 41.5442 23.2640 7.6748 23.0035 0.7360 41.3520 0.3238 24.5780 35.0317 29.8701 16.4785 2.3007 34.5389 16.8549 17.4427
temp: 298.150 k
press: 1.00000 atm
elementType: 8 8 6 6 6 6 6 6 6 6 6 6 6 6 1 1 1 1 1 1 1 1 1 1 1 1 1 1 1 1
symmnumber: 1
zpe: 655183.1 jmol-1
zpe.correction: 0.249546 hartree
zpe.thermalcorrener: 0.264039 hartree
zpe.thermalcorrenthalpy: 0.264983 hartree
zpe.thermalcorrgfe: 0.206392 hartree
zpe.sumelectzpe: -616.292316 hartree
zpe.sumelectthermal: -616.277824 hartree
zpe.sumelectthermalent: -616.276879 hartree
zpe.sumelectthermalfe: -616.335470 hartree
dipole: 0.6985 -0.0044 1.1869
dipole: 1.3772
quadrupole: -78.3186 -77.7024 -90.6088
quadrupole: -0.0655 -5.2200 -0.0347
quadrupole: 3.8913 4.5076 -8.3989 -0.0655 -5.2200 -0.0347
hfenergy: -616.5418624 hartree
pointgroup: C01 [X(C12H16O2)]
dipole: -0.2747604 -0.0049204 0.4669788 debye
polarizability: 177.2511254|0.2476527|134.799664|-11.0838106|0.4111671|93.6117794 unknown
InChI: InChI=1S/C12H16O2/c1-8-6-9(2)11(10(3)7-8)4-5-12(13)14/h6-7,13H,4-5H2,1-3H3
charge 0 multiplicity 1
30 atoms
O  4.321996 0.003911 1.42354
O  4.10931 0.039213 -0.887799
C  -0.279848 0.00527 -0.402665
C  1.206996 0.016821 -0.738526
C  -0.987216 1.231497 -0.213601
C  -0.974342 -1.232104 -0.24247
C  -3.061653 -0.017301 0.298849
C  -2.359112 1.200193 0.135423
C  -2.346886 -1.223085 0.106682
C  2.081152 0.007067 0.540969
C  -0.300656 2.57873 -0.389685
C  -0.274177 -2.567792 -0.449841
C  -4.541118 -0.02796 0.644751
C  3.566338 0.018763 0.238638
H  1.469986 0.906183 -1.337202
H  1.479362 -0.855808 -1.357245
H  1.854327 0.877982 1.185189
H  1.863652 -0.879942 1.165971
H  -2.89154 2.149123 0.281129
H  -2.869731 -2.18049 0.2293
H  0.582055 2.691115 0.267839
H  0.053553 2.724179 -1.428452
H  -0.994238 3.4046 -0.157133
H  0.083681 -2.684401 -1.490983
H  0.608265 -2.687183 0.206794
H  -0.95986 -3.40595 -0.239019
H  -4.825497 -0.951394 1.179527
H  -4.81462 0.832842 1.280713
H  -5.165237 0.028432 -0.268628
H  5.290759 0.012591 1.192335
