program: Gaussian 09
title: 000232524
version: EM64L-G09RevD.01
frameworkgroup: C1[X(C8H7NO3)]
method: RPBEPBE
basis: SDD
operation: Freq
keyword: #pfreq=noraman
keyword: PBEPBE/SDD
title: #p freq=noraman PBEPBE/SDD
converged: NO YES NO NO
title: Mulliken charges:
elementType: O O O N C C C C C C C C H H H H H H H
charge: -0.441377 -0.254731 -0.237991 -0.402806 0.476497 0.265754 -0.413946 -0.329695 -0.336519 -0.322181 0.109851 -0.063200 0.224959 0.308612 0.273227 0.276445 0.308215 0.174162 0.384722
chargesum: 0.00000
title: Mulliken charges with hydrogens summed into heavy atoms:
elementType: O O O N C C C C C C C C
charge: -0.056655 -0.254731 -0.237991 -0.094591 0.476497 0.265754 -0.188987 -0.021083 -0.063291 -0.045735 0.109851 0.110962
polarizability: 1.83125083e+02 1.80081336e+00 1.07547914e+02 -2.94401955e-04 7.12090429e-03 4.08860990e+01
1716.lowfreq: -7.0279 -0.0012 -0.0008 -0.0007 4.4899 11.3787 57.1797 80.9371 105.0656
frequency: 57.1475 80.9281 105.0585 135.7514 211.0807 229.3738 310.9008 357.5698 359.0350 414.8068 484.0050 518.1221 545.7562 588.4249 627.5867 660.8056 672.1031 688.2562 763.2598 780.0912 837.8813 843.9976 883.2723 953.1360 983.3314 997.5738 1011.1254 1019.7869 1098.3422 1125.2781 1151.3731 1196.1008 1260.8949 1307.4508 1322.3029 1362.4632 1392.9951 1421.4869 1489.5932 1508.5747 1587.5147 1619.0141 1638.9031 1648.0333 2929.9850 3118.7607 3164.1424 3172.6617 3198.3101 3512.2658 3532.8516
redmass: 10.8178 5.3132 4.6781 8.0240 8.6003 3.5217 6.3549 8.1405 3.4140 2.9774 6.0760 2.5915 5.6956 1.2309 7.1181 1.1691 4.6793 3.6253 4.4499 6.3178 6.4601 1.3941 1.5217 1.5941 1.3664 4.6516 1.3379 2.9709 3.1775 1.3602 1.6309 1.1770 1.9166 1.4472 2.8615 2.4967 1.5126 4.4506 2.0372 3.0391 5.2424 5.5973 8.2754 5.4113 1.0868 1.0900 1.0950 1.0908 1.0961 1.0769 1.0642
irintensity: 6.2424 1.7665 10.2880 7.7702 1.8408 7.0623 4.2983 13.3102 21.1480 0.0687 12.7864 46.6518 22.1601 72.3158 0.8165 66.9909 21.9159 80.8007 21.4374 2.4854 4.9348 29.4144 58.2124 2.0465 0.1949 158.7847 1.3843 171.1237 26.3061 17.3181 157.0835 9.4001 18.7322 55.0110 138.4520 25.7087 81.7237 26.3418 181.3577 250.9663 6.8737 265.0569 374.1504 66.1424 126.7040 14.5816 3.6020 0.7318 2.3628 15.8469 50.9088
temp: 298.150 k
press: 1.00000 atm
elementType: 8 8 8 7 6 6 6 6 6 6 6 6 1 1 1 1 1 1 1
symmnumber: 1
zpe: 364140.1 jmol-1
zpe.correction: 0.138694 hartree
zpe.thermalcorrener: 0.149021 hartree
zpe.thermalcorrenthalpy: 0.149965 hartree
zpe.thermalcorrgfe: 0.102054 hartree
zpe.sumelectzpe: -588.639452 hartree
zpe.sumelectthermal: -588.629125 hartree
zpe.sumelectthermalent: -588.628181 hartree
zpe.sumelectthermalfe: -588.676091 hartree
dipole: -1.6852 2.6967 -0.0004
dipole: 3.1800
quadrupole: -67.9695 -65.0397 -71.6145
quadrupole: -22.8979 -0.0006 0.0029
quadrupole: 0.2384 3.1682 -3.4066 -22.8979 -0.0006 0.0029
hfenergy: -588.7781453 hartree
pointgroup: C01 [X(C8H7N1O3)]
dipole: 0.6373245 1.0766061 0.0001671 debye
dipolederiv: -0.5883386 -0.3690997 0.0000557 -0.6295653 -1.1375884 0.0000805 -0.000002 -0.0000664 -0.4293296 -1.2121205 0.2519612 -0.000014 0.255959 -0.7312054 -0.0000089 -0.0002284 0.000149 -0.3376663 -0.5747304 0.0166704 0.0000183 0.7767967 -0.9326773 0.0001703 0.0004052 -0.0003105 -0.34641 -1.8867405 0.2934594 0.0001787 0.3797609 -0.3879524 -0.0001153 0.0001482 0.0000207 -0.3256054 1.3459705 0.036757 -0.0000706 0.324619 0.1365161 -0.000026 -0.0000552 -0.0000129 0.1201751 -0.9941866 -0.1037458 -0.0000152 -0.1492825 -0.1361622 0.0000165 0.0000027 0.0000158 -0.0120686 -0.5052596 0.0781566 0.0000123 0.2484424 0.0632464 -0.0000465 -0.0001293 -0.0000612 -0.2040748 -0.3859843 -0.1099441 0.0000436 -0.3714106 -0.1211316 -0.0000115 0.0000876 0.0000084 -0.1706405 0.2873474 -0.0273535 -0.0000007 0.1916967 0.0780227 -0.0000283 0.0000427 -0.0000297 -0.0985987 0.3502516 0.0917914 -0.0000217 -0.0945271 0.0718067 -0.0000358 0.0000853 -0.0000163 -0.0990665 2.2331158 0.148464 0.0000332 0.3580943 1.4443316 -0.0000792 0.0001823 -0.0001021 0.2354291 1.5130119 -0.2711485 -0.0002314 -1.1486775 1.2558112 -0.0001543 -0.0008763 0.0000729 0.1526309 0.0215995 -0.1034111 0.0000133 -0.0879557 -0.0709078 0.0000447 -0.0000025 0.0000474 0.1689952 0.1123339 0.051467 -0.0000216 0.0238628 0.0748544 0.0000262 -0.0000459 0.0000069 0.1830635 0.0691584 0.0818188 -0.0000119 0.0494619 0.0390783 0.0000201 0.0000018 0.0000255 0.1567253 0.1082043 -0.0322688 0.0000114 -0.0389317 0.0031253 0.0000312 0.0000146 0.000032 0.1553354 0.1307275 0.0246544 -0.0000067 0.0059981 0.1044036 0.0000339 -0.0000797 0.0000713 0.3244822 -0.1804283 -0.1117682 0.0000722 -0.2431793 -0.0838133 0.0000724 0.0005089 0.0001433 0.1252226 0.1560682 0.0535393 -0.0000448 0.1488381 0.3302418 0.00001 -0.00006 0.000006 0.4014009 unknown
polarizability: 183.1679632|0.0173078|107.5050339|-0.0001232|-0.0071259|40.886099 unknown
InChI: InChI=1S/C8H7NO3/c10-5-9-7-3-1-6(2-4-7)8(11)12/h1-5,9,11H
charge 0 multiplicity 1
19 atoms
O  -3.265602 -1.576391 -0.000072
O  -3.792455 0.687956 -0.000429
O  3.785482 -1.290868 -0.000591
N  2.724156 0.825175 -0.000181
C  1.34064 0.504361 -0.000141
C  -1.448488 0.000173 -0.000063
C  0.414171 1.586553 -0.000349
C  0.864267 -0.836348 0.00011
C  -0.965415 1.33578 -0.000315
C  -0.522555 -1.07449 0.000141
C  -2.916719 -0.213088 -0.000014
C  3.823437 -0.034009 -0.000018
H  0.780462 2.621294 -0.000534
H  1.578039 -1.661659 0.000293
H  -1.687877 2.158169 -0.000467
H  -0.899766 -2.100907 0.000339
H  2.95017 1.82407 -0.000409
H  4.777772 0.542535 -0.000838
H  -4.25742 -1.649707 -0.000258
