program: Gaussian 09
title: 000232522
version: EM64L-G09RevD.01
frameworkgroup: C1[X(C11H9N3O2)]
method: RPBEPBE
basis: SDD
operation: Freq
keyword: #p
keyword: freq=noraman
keyword: PBEPBE/SDD
title: #p freq=noraman PBEPBE/SDD
converged: NO YES NO NO
title: Mulliken charges:
elementType: O O N N N C C C C C C C C C C C H H H H H H H H H
charge: -0.367343 -0.169845 -0.382982 -0.075745 0.007024 0.416879 -0.350310 -0.350186 -0.196651 -0.196683 -0.238691 0.059836 0.233247 -0.163915 -0.268945 -0.256412 0.247625 0.247625 0.230229 0.230225 0.231006 0.366167 0.240387 0.252367 0.255089
chargesum: 0.00000
title: Mulliken charges with hydrogens summed into heavy atoms:
elementType: O O N N N C C C C C C C C C C C
charge: -0.367343 -0.169845 -0.016814 -0.075745 0.007024 0.416879 -0.102685 -0.102561 0.033577 0.033542 -0.007684 0.059836 0.233247 0.076472 -0.016578 -0.001323
polarizability: 2.35449298e+02 -9.08220411e+00 1.05186378e+02 3.63522602e-02 3.99987713e-02 9.98870604e+01
1716.lowfreq: -39.2127 -9.9192 -0.0009 -0.0008 -0.0008 5.4703 10.9037 28.4431 41.7820
frequency: -39.2091 27.5068 41.6622 54.4801 87.3673 140.8223 206.5328 221.0390 257.0101 346.6005 386.8036 399.7992 408.4197 480.2963 515.9689 527.5214 610.3230 617.1689 652.2890 677.0615 677.8888 692.8335 744.9363 779.9382 786.9910 794.0864 814.0854 833.5261 872.7757 915.2106 924.3993 958.7666 959.9540 967.5987 979.9288 989.4765 992.4490 1018.6763 1054.2827 1073.8281 1085.6343 1105.2379 1163.8997 1171.3932 1186.9700 1220.5955 1265.4665 1303.3055 1343.6210 1383.9376 1390.1136 1430.4877 1440.4357 1469.3590 1504.7780 1531.5408 1551.8182 1602.6734 1605.1566 1719.8226 3132.7787 3142.7279 3142.9048 3145.0721 3156.8728 3166.4324 3175.3680 3188.9113 3534.9087
redmass: 4.9057 5.7179 7.4318 5.9399 6.2921 6.5075 5.5473 7.0813 5.8727 8.6731 6.2462 4.1011 2.8577 3.6909 2.6492 8.1918 6.5340 8.0200 6.3999 4.7841 6.0971 1.8115 1.4278 2.0099 6.4503 2.1097 1.9981 1.2469 5.8623 1.7996 4.5927 1.3762 8.6543 1.3784 1.4485 5.1451 1.3880 2.0863 2.8240 1.4991 1.6361 2.8660 1.4069 1.0558 2.1281 2.8011 3.3610 1.3256 1.7603 10.0994 1.6186 2.3942 2.2106 2.2749 3.6418 3.8426 5.1526 6.2240 6.8975 10.7475 1.0850 1.0902 1.0891 1.0933 1.0933 1.0969 1.1013 1.0993 1.0759
irintensity: 0.2113 1.9283 1.3167 2.0300 0.2428 2.6738 6.8044 0.5487 4.3449 3.7405 2.7349 0.0435 0.0101 20.5906 9.6963 8.1768 0.1266 4.3089 5.1116 0.0114 2.9944 38.7063 80.9419 74.9458 4.8521 0.2110 90.7459 0.0448 6.9663 40.3772 239.7577 0.0367 112.0040 0.0793 0.4902 2.0083 0.9673 40.4630 67.5838 11.4604 4.7891 615.2953 37.9532 0.0328 114.7552 44.7854 5.4239 0.1277 7.5316 0.8099 5.5524 138.5027 4.3177 296.6434 714.8689 311.8373 135.1596 4.3027 5.8028 250.2071 0.4043 15.3953 8.8880 17.2379 29.2538 16.9182 6.7463 15.4621 67.3691
temp: 298.150 k
press: 1.00000 atm
elementType: 8 8 7 7 7 6 6 6 6 6 6 6 6 6 6 6 1 1 1 1 1 1 1 1 1
symmnumber: 1
zpe: 483007.4 jmol-1
zpe.correction: 0.183968 hartree
zpe.thermalcorrener: 0.196281 hartree
zpe.thermalcorrenthalpy: 0.197225 hartree
zpe.thermalcorrgfe: 0.143088 hartree
zpe.sumelectzpe: -738.150133 hartree
zpe.sumelectthermal: -738.137820 hartree
zpe.sumelectthermalent: -738.136876 hartree
zpe.sumelectthermalfe: -738.191013 hartree
dipole: 1.7589 -1.2508 0.0034
dipole: 2.1583
quadrupole: -56.1597 -98.3873 -85.9146
quadrupole: 0.6631 -0.0011 0.0531
quadrupole: 23.9942 -18.2335 -5.7607 0.6631 -0.0011 0.0531
hfenergy: -738.334101 hartree
pointgroup: C01 [X(C11H9N3O2)]
dipole: 0.6955571 -0.4871025 -0.0000234 debye
dipolederiv: -2.4403871 -0.2183899 0.000093 -0.4641907 -0.5615438 0.0001799 0.0001033 0.0002382 -0.2866941 -0.785806 0.0929577 -0.0000753 0.1003109 -0.8410691 0.0003906 0.0001176 0.0003353 -0.2670945 -2.7137173 0.0232959 0.0000774 0.1875744 -0.3644956 0.0000509 -0.0000448 0.0000623 -0.3480594 -1.1752222 -0.1549813 0.0001245 0.3436563 -0.369443 0.000053 0.0000047 0.0000716 -0.2297917 -0.8309055 -0.0449161 0.0000628 -0.7408457 -0.4131055 0.0001107 0.0003377 0.0000789 -0.1868245 1.5308541 -0.0384022 0.0001756 -0.4508424 0.0275956 0.0002241 0.0003579 0.0002073 0.2106227 -0.2912273 -0.0384473 -0.0635075 0.046833 -0.1168343 -0.0006667 -0.1132056 0.0318967 -0.0161235 -0.2910275 -0.0381697 0.0636524 0.0474717 -0.1169363 0.0011424 0.1132678 -0.031535 -0.0160546 0.0163139 -0.0478312 0.0618795 -0.051555 -0.1240517 -0.0187322 0.0553371 -0.0235358 0.0986985 0.0162706 -0.048071 -0.0616924 -0.0517219 -0.1238625 0.019594 -0.0551488 0.02433 0.0986083 0.0491029 -0.0770797 0.0000956 -0.0672101 -0.144897 0.0001086 0.0000949 0.0001396 -0.0961018 2.3872399 0.2106182 -0.000194 0.7504932 0.2957135 -0.0000539 -0.0004996 -0.0000375 0.2141317 3.3379122 0.0314934 -0.0001344 -0.0229108 1.3935609 -0.0007782 -0.0001638 -0.0007035 0.3096856 -0.2327534 0.1171176 -0.0000366 0.064943 -0.5017448 0.0001171 0.0000124 0.0001171 -0.0945607 0.5813818 0.1166422 -0.0001376 -0.1033899 0.4746434 -0.0001704 -0.0000753 -0.0002054 -0.034845 0.569019 -0.1208941 -0.0000474 0.1956692 0.4691714 -0.000177 -0.000161 -0.000144 -0.0328289 0.0736586 0.039402 0.0819876 0.0337301 0.1458791 -0.0162535 0.0944601 -0.0178577 -0.0102561 0.0735647 0.0391104 -0.082128 0.0333748 0.1459718 0.0156366 -0.0946157 0.0173028 -0.0102959 0.0181133 0.0269414 -0.0804623 0.0394661 0.1498978 0.0211047 -0.0979416 0.020948 -0.0645329 0.01818 0.0272123 0.0803134 0.0398151 0.14974 -0.0219096 0.0977646 -0.0217261 -0.0644328 -0.1144266 0.0723146 -0.000095 0.0807857 0.1436481 -0.0001206 -0.0001026 -0.000115 0.0883577 0.2529779 0.0349984 -0.0000255 0.0125022 0.2424121 0.0000179 0.0000096 -0.0000039 0.3198534 -0.0848393 -0.0466707 0.0000617 -0.0485973 0.0969953 0.0000364 0.0000564 0.0000382 0.1815565 -0.0285941 0.0827821 -0.0000093 0.1182665 0.0096906 0.0000177 -0.0000082 0.0000306 0.1190248 0.0643177 -0.0410332 0.000022 -0.0936285 -0.066936 0.0000778 0.0000429 0.0000674 0.117957 unknown
polarizability: 235.5738429|-8.1393205|105.0615747|0.0114033|0.05457|99.8873192 unknown
InChI: InChI=1S/C11H9N3O2/c15-11(14-10-12-7-4-8-13-10)16-9-5-2-1-3-6-9/h1-8,14H
charge 0 multiplicity 1
25 atoms
O  -1.053757 -0.859878 0.000963
O  -0.180935 1.349125 -0.000367
N  1.175248 -0.620858 0.000618
N  3.411528 -1.212439 0.000524
N  2.783834 1.156435 -0.000177
C  -2.406618 -0.388985 0.000495
C  -3.063688 -0.200293 -1.230794
C  -3.06319 -0.195891 1.231369
C  -4.421726 0.190176 -1.225002
C  -4.421226 0.194567 1.22471
C  -5.101775 0.38767 -0.000358
C  2.502858 -0.177665 0.000358
C  -0.006101 0.123266 0.000272
C  5.134836 0.504665 -0.000388
C  4.722996 -0.849387 0.000151
C  4.110108 1.477529 -0.00054
H  -2.519625 -0.357756 -2.167293
H  -2.518766 -0.349972 2.168219
H  -4.945222 0.340751 -2.175263
H  -4.94434 0.348562 2.174634
H  -6.154126 0.691365 -0.000684
H  1.069853 -1.639532 0.001059
H  6.190936 0.783332 -0.000675
H  5.447892 -1.67045 0.000313
H  4.336106 2.549462 -0.000944
