program: Gaussian 09
title: 000232518
version: EM64L-G09RevD.01
frameworkgroup: C1[X(C10H14N2O2)]
method: RPBEPBE
basis: SDD
operation: Freq
keyword: #p
keyword: freq=noraman
keyword: PBEPBE/SDD
title: #p freq=noraman PBEPBE/SDD
converged: YES YES NO NO
title: Mulliken charges:
elementType: O O N N C C C C C C C C C C H H H H H H H H H H H H H H
charge: -0.400913 -0.247517 -0.152549 -0.597856 0.501985 -0.335987 0.402369 -0.455193 -0.409416 -0.351619 -0.351878 -0.646391 -0.647109 0.177158 0.252176 0.228197 0.245388 0.235764 0.235493 0.233487 0.215940 0.232804 0.215949 0.233714 0.233066 0.272687 0.304088 0.376162
chargesum: 0.00000
title: Mulliken charges with hydrogens summed into heavy atoms:
elementType: O O N N C C C C C C C C C C
charge: -0.024752 -0.247517 -0.152549 -0.021080 0.501985 -0.083811 0.402369 -0.226996 -0.164028 -0.115855 -0.116385 0.035841 0.035620 0.177158
polarizability: 1.94915356e+02 3.70208608e+00 1.24008051e+02 -5.29868079e+00 4.09515342e+00 8.76736606e+01
1716.lowfreq: -4.7015 -0.0008 -0.0004 -0.0003 6.8954 10.9213 27.5007 50.7236 58.6701
frequency: 27.3800 50.7000 58.6655 77.8645 100.8163 129.8208 149.1453 205.8524 212.2313 239.6938 269.4764 279.2077 321.1084 362.2425 386.2377 417.3284 456.3361 471.5776 510.9395 543.4206 581.4393 590.8263 616.2582 638.0569 672.1926 732.5323 742.7524 805.5752 809.4686 825.2095 849.9555 939.2241 943.8243 953.3428 996.3536 1053.3579 1056.8747 1111.0220 1111.7416 1113.7390 1131.1559 1156.8034 1166.6005 1192.9275 1217.0369 1250.3483 1264.0086 1281.7249 1336.6941 1359.9092 1370.4392 1389.2789 1426.2665 1438.9254 1459.2960 1463.9555 1474.9806 1495.4944 1507.4023 1525.1903 1568.2836 1609.4274 1629.6375 1663.8850 2935.3990 2944.0657 2999.7225 3002.8354 3006.1224 3093.5586 3103.6999 3117.3388 3121.4395 3159.7054 3164.0717 3466.5947 3512.6191 3605.8811
redmass: 3.9143 5.0155 8.3018 2.4017 2.9833 2.1511 3.1150 1.7638 1.3708 1.9420 3.2747 1.3903 4.3614 4.3274 4.1020 2.9285 3.6604 3.5486 2.7158 1.9614 1.5408 1.8227 4.3030 5.2196 2.8247 4.0360 4.6027 1.2578 2.0527 4.8926 2.8876 1.3910 3.0786 1.3558 3.1406 2.8364 1.4876 1.3131 1.2489 2.0488 1.3985 2.1009 1.6413 1.4645 1.6436 1.5202 2.8813 1.4232 1.4357 3.1787 1.8537 3.9697 1.7549 1.6342 1.2128 1.0407 1.0462 1.0849 1.1522 2.3310 6.5596 1.4176 6.0193 3.0287 1.0369 1.0396 1.0993 1.1026 1.0849 1.0958 1.0938 1.0892 1.0886 1.0929 1.0935 1.0453 1.0639 1.0981
irintensity: 0.1197 1.6641 0.2776 0.0814 5.0219 0.8208 3.1691 1.6165 1.0683 12.5341 1.2392 37.1752 0.4817 4.0942 9.5839 1.7380 14.8321 4.0287 3.2631 136.6154 10.3599 324.9084 6.3308 18.8810 170.7068 2.4604 4.2040 1.5333 51.9339 9.0662 12.6003 0.1140 14.3759 0.2603 0.3739 309.1287 23.7226 1.0360 0.1797 1.7795 7.5991 10.3370 8.3444 56.1784 0.6851 9.2385 31.8077 14.0680 5.8652 123.1782 21.5241 7.8223 5.1601 0.9436 13.0431 0.0628 21.2570 1.9067 15.7171 245.2466 4.9231 175.9121 188.9122 128.1772 116.0668 88.0937 8.1251 87.6557 25.0033 4.5215 48.2550 12.2691 7.9977 24.2535 11.8405 10.7204 25.6742 12.1872
temp: 298.150 k
press: 1.00000 atm
elementType: 8 8 7 7 6 6 6 6 6 6 6 6 6 6 1 1 1 1 1 1 1 1 1 1 1 1 1 1
symmnumber: 1
zpe: 598291.4 jmol-1
zpe.correction: 0.227877 hartree
zpe.thermalcorrener: 0.242617 hartree
zpe.thermalcorrenthalpy: 0.243561 hartree
zpe.thermalcorrgfe: 0.185191 hartree
zpe.sumelectzpe: -648.347297 hartree
zpe.sumelectthermal: -648.332557 hartree
zpe.sumelectthermalent: -648.331613 hartree
zpe.sumelectthermalfe: -648.389983 hartree
dipole: 4.8333 0.4136 -0.6203
dipole: 4.8905
quadrupole: -76.5195 -79.0275 -81.9559
quadrupole: -4.0309 2.2456 -2.2678
quadrupole: 2.6482 0.1401 -2.7883 -4.0309 2.2456 -2.2678
hfenergy: -648.5751743 hartree
pointgroup: C01 [X(C10H14N2O2)]
dipole: 1.9044156 -0.0810788 -0.2620365 debye
polarizability: 195.0273788|-2.2629793|112.1374039|-5.3657614|-17.4454417|99.432285 unknown
InChI: InChI=1S/C10H14N2O2/c1-12(2)8-5-3-7(4-6-8)9(11)10(13)14/h3-6,9,13H,11H2,1-2H3
charge 0 multiplicity 1
28 atoms
O  -3.095087 0.092812 -1.902966
O  -3.543729 -1.363392 -0.150667
N  3.401106 -0.253259 -0.025503
N  -2.897786 0.675562 1.652196
C  -0.810417 0.47664 0.198998
C  -2.326431 0.748395 0.299299
C  2.023842 -0.014386 0.045233
C  0.050585 1.375526 -0.472487
C  -0.235514 -0.675798 0.792046
C  1.438097 1.147914 -0.550737
C  1.145982 -0.924822 0.719997
C  4.274167 0.690893 -0.731585
C  3.970702 -1.458486 0.587461
C  -3.056318 -0.284652 -0.560516
H  -2.521056 1.739629 -0.151483
H  -0.369196 2.272703 -0.945105
H  -0.880398 -1.39302 1.314979
H  2.063515 1.877138 -1.073298
H  1.544026 -1.829084 1.189266
H  4.00116 0.786105 -1.802966
H  5.315993 0.337239 -0.678704
H  4.236465 1.703804 -0.280474
H  5.060639 -1.470477 0.428782
H  3.552801 -2.386121 0.144534
H  3.786932 -1.491753 1.681054
H  -2.315475 1.106759 2.37353
H  -3.24421 -0.256766 1.900496
H  -3.515594 -0.634908 -2.436779
